program: Orca
programVersion: 5.0.2
elementType: N C C C C C C C C C C C C C C C C C C C C C H H H H H H H H H H H H H H H H H H H H H H H H H
charge: 0
multiplicity: 1
keywords: wb97x-d3
keywords: def2-TZVPP
keywords: def2/J RIJCOSX
keywords: DEFGRID2
keywords: scfconv7
keywords: smallprint printgap noloewdin
keywords: NOSOSCF
formula: C21H25N
InChI: InChI=1/C21H25N/c1-21(2,3)15-8-5-9-16-22(4)17-19-13-10-12-18-11-6-7-14-20(18)19/h5-7,9-14H,16-17H2,1-4H3
47 atoms
N  -2.257113 -1.35565 0.62682
C  -2.258838 -0.420818 -0.493591
C  -2.514358 1.002689 -0.080399
C  -1.508507 1.771093 0.578114
C  -1.793181 3.113585 0.949038
C  4.564612 -1.906846 -1.289775
C  -1.629592 -2.614253 0.237199
C  -3.726365 1.585562 -0.350318
C  -0.219979 1.257934 0.866212
C  -3.607249 -1.580593 1.103706
C  -3.061666 3.666311 0.653788
C  -4.007077 2.918123 0.012976
C  -0.798736 3.881727 1.599527
C  5.367035 -3.073185 -0.703123
C  4.863645 -0.625659 -0.50285
C  4.937433 -1.710757 -2.762888
C  -0.148443 -2.462934 0.133362
C  0.724751 2.026968 1.490019
C  0.433508 3.352846 1.866684
C  3.1318 -2.199467 -1.189751
C  0.54307 -2.618728 -0.999071
C  1.946938 -2.412701 -1.094802
H  -3.009943 -0.711906 -1.244488
H  -1.293306 -0.480608 -0.99973
H  -1.849814 -3.348798 1.016723
H  -2.042767 -3.017478 -0.700589
H  -4.489627 1.006314 -0.856548
H  0.029707 0.243756 0.587078
H  -4.271654 -2.008492 0.338328
H  -4.05389 -0.64578 1.442066
H  -3.595074 -2.260887 1.955639
H  -3.26577 4.691522 0.938118
H  -4.975696 3.341169 -0.219017
H  -1.030654 4.902215 1.880013
H  5.121449 -3.235593 0.346865
H  6.43492 -2.858005 -0.770593
H  5.175133 -3.999923 -1.244875
H  4.306686 0.22328 -0.900862
H  4.604168 -0.737551 0.55046
H  5.927543 -0.389834 -0.565285
H  4.735212 -2.609242 -3.346963
H  4.380316 -0.884895 -3.206664
H  6.001633 -1.484764 -2.84985
H  0.374123 -2.18798 1.044293
H  1.703503 1.613713 1.696699
H  1.187541 3.949436 2.363023
H  0.021982 -2.884051 -1.914972
elementType: N C H
totalener: -870.03218679 hartree
nucrepener: 1651.27585971 hartree
electener: -2521.30804650 hartree
oneelecener: -4455.33882935 hartree
twoeener: 1934.03078285 hartree
cpcmener: -0.02204883 hartree
kineticenergy: 865.86970084 hartree
xcener: -88.992947253617 hartree
chargesum: -0.0000000
charge: -0.235653 -0.035883 0.041342 -0.085635 -0.024681 0.073598 -0.057900 -0.163747 -0.207322 -0.216966 -0.148291 -0.136363 -0.115790 -0.289300 -0.294129 -0.290907 -0.101719 -0.186115 -0.147839 -0.319386 -0.245491 0.246920 0.112811 0.129359 0.102448 0.089694 0.136056 0.157233 0.081944 0.106357 0.104630 0.144431 0.158588 0.143117 0.100672 0.097786 0.100649 0.100304 0.100754 0.098336 0.100139 0.100764 0.097635 0.122290 0.156419 0.160216 0.138625
qa: -0.2357 -0.0359 0.0413 -0.0856 -0.0247 0.0736 -0.0579 -0.1637 -0.2073 -0.2170 -0.1483 -0.1364 -0.1158 -0.2893 -0.2941 -0.2909 -0.1017 -0.1861 -0.1478 -0.3194 -0.2455 0.2469 0.1128 0.1294 0.1024 0.0897 0.1361 0.1572 0.0819 0.1064 0.1046 0.1444 0.1586 0.1431 0.1007 0.0978 0.1006 0.1003 0.1008 0.0983 0.1001 0.1008 0.0976 0.1223 0.1564 0.1602 0.1386
va: 2.7779 3.6610 3.4776 3.8618 3.8476 4.0183 3.9416 3.9086 3.9401 3.9678 3.9268 3.8980 3.8836 3.8912 3.8945 3.8936 3.8277 3.9638 3.8889 4.1083 3.9989 3.6400 1.0158 0.9886 0.9972 1.0095 1.0097 0.9899 1.0011 0.9908 0.9977 1.0047 0.9902 1.0054 1.0056 1.0031 1.0060 1.0061 1.0056 1.0037 1.0060 1.0054 1.0032 1.0184 0.9948 0.9895 1.0039
dispcorr: -0.020467308 hartree
energy: -870.052654097552
dipole: 15.15509 -15.27386 -0.11877 -13.13715 12.93396 -0.20319 -4.72131 4.46725 -0.25407
magnitude: 0.34632 au
magnitude: 0.88029 debye
