program: Orca
programVersion: 5.0.2
elementType: N C C C C C C C C C C C C C C C C C C C C C H H H H H H H H H H H H H H H H H H H H H H H H H
charge: 0
multiplicity: 1
keywords: wb97x-d3
keywords: def2-TZVPP
keywords: def2/J RIJCOSX
keywords: DEFGRID2
keywords: scfconv7
keywords: smallprint printgap noloewdin
keywords: NOSOSCF
formula: C21H25N
InChI: InChI=1/C21H25N/c1-21(2,3)15-8-5-9-16-22(4)17-19-13-10-12-18-11-6-7-14-20(18)19/h5-7,9-14H,16-17H2,1-4H3
47 atoms
N  -3.036801 -1.667666 0.406273
C  -2.451073 -0.718017 1.348666
C  -2.368547 0.687797 0.806472
C  -1.146291 1.423518 0.756881
C  -1.147841 2.72563 0.177868
C  4.116702 -1.54724 -0.719433
C  -2.319054 -1.730232 -0.864661
C  -3.518183 1.278208 0.340072
C  0.088621 0.92618 1.24809
C  -3.141971 -2.970502 1.036306
C  -2.355123 3.279922 -0.301118
C  -3.520169 2.572087 -0.210175
C  0.063635 3.452446 0.082423
C  4.394547 -1.556394 0.78862
C  4.817681 -0.348162 -1.366651
C  4.623953 -2.848787 -1.349594
C  -0.849765 -2.004047 -0.756866
C  1.242675 1.653171 1.145089
C  1.236423 2.929787 0.548859
C  2.67196 -1.435364 -0.934392
C  0.07579 -1.166366 -1.232198
C  1.476943 -1.348573 -1.085349
H  -1.472261 -1.062029 1.700491
H  -3.089948 -0.710602 2.236405
H  -2.795231 -2.511741 -1.463622
H  -2.470259 -0.793757 -1.406621
H  -4.452578 0.734242 0.388685
H  0.136287 -0.048881 1.710746
H  -2.183759 -3.390706 1.369892
H  -3.596319 -3.682238 0.346549
H  -3.787012 -2.904263 1.913451
H  -2.341481 4.272616 -0.734579
H  -4.448968 2.998782 -0.565606
H  0.042915 4.436021 -0.371492
H  4.043331 -0.637339 1.260297
H  5.467682 -1.64023 0.969211
H  3.902785 -2.397826 1.277891
H  5.895759 -0.420607 -1.213472
H  4.631627 -0.311434 -2.440517
H  4.477674 0.591914 -0.930457
H  5.699641 -2.943356 -1.191894
H  4.139408 -3.719072 -0.905784
H  4.4379 -2.867682 -2.423941
H  -0.537014 -2.908833 -0.244295
H  2.170028 1.240276 1.521682
H  2.157738 3.491255 0.466407
H  -0.238398 -0.258385 -1.740354
elementType: N C H
totalener: -870.02752168 hartree
nucrepener: 1721.44393601 hartree
electener: -2591.47145769 hartree
oneelecener: -4595.71279031 hartree
twoeener: 2004.24133262 hartree
cpcmener: -0.02166147 hartree
kineticenergy: 865.87407989 hartree
xcener: -88.999965836251 hartree
chargesum: -0.0000000
charge: -0.204643 -0.095439 0.129989 -0.055929 -0.023465 0.067509 -0.066179 -0.212766 -0.270854 -0.205820 -0.150717 -0.136077 -0.090480 -0.289967 -0.288316 -0.289037 -0.112386 -0.144799 -0.170880 -0.348798 -0.254337 0.285601 0.108059 0.116864 0.109101 0.097792 0.125300 0.151902 0.082240 0.101858 0.100421 0.143610 0.157777 0.142398 0.095204 0.098942 0.101402 0.098066 0.101050 0.097691 0.097343 0.100008 0.100839 0.132286 0.175544 0.158780 0.133311
qa: -0.2046 -0.0954 0.1300 -0.0559 -0.0235 0.0675 -0.0662 -0.2128 -0.2709 -0.2058 -0.1507 -0.1361 -0.0905 -0.2900 -0.2883 -0.2890 -0.1124 -0.1448 -0.1709 -0.3488 -0.2543 0.2856 0.1081 0.1169 0.1091 0.0978 0.1253 0.1519 0.0822 0.1019 0.1004 0.1436 0.1578 0.1424 0.0952 0.0989 0.1014 0.0981 0.1011 0.0977 0.0973 0.1000 0.1008 0.1323 0.1755 0.1588 0.1333
va: 2.8596 3.8456 3.4455 3.6770 3.8487 4.0278 3.9760 3.9389 3.8910 3.9529 3.9272 3.8973 3.8705 3.8920 3.8905 3.8898 3.7296 3.8625 3.9377 4.1280 3.9830 3.5510 0.9994 0.9962 0.9981 1.0006 1.0308 1.0108 0.9950 0.9970 0.9947 1.0049 0.9901 1.0049 1.0089 1.0039 1.0057 1.0033 1.0060 1.0062 1.0033 1.0059 1.0060 1.0096 0.9812 0.9910 0.9992
dispcorr: -0.023637934 hartree
energy: -870.051159616422
dipole: 15.01463 -14.52837 0.48626 -14.51196 14.13747 -0.37449 -0.33629 0.61501 0.27872
magnitude: 0.67407 au
magnitude: 1.71336 debye
