program: Orca
programVersion: 5.0.2
elementType: N C C C C C C C C C C C C C C C C C C C C C H H H H H H H H H H H H H H H H H H H H H H H H H
charge: 0
multiplicity: 1
keywords: wb97x-d3
keywords: def2-TZVPP
keywords: def2/J RIJCOSX
keywords: DEFGRID2
keywords: scfconv7
keywords: smallprint printgap noloewdin
keywords: NOSOSCF
formula: C21H25N
InChI: InChI=1/C21H25N/c1-21(2,3)15-8-5-9-16-22(4)17-19-13-10-12-18-11-6-7-14-20(18)19/h5-7,9-14H,16-17H2,1-4H3
47 atoms
N  -2.913911 -1.696743 0.576886
C  -2.374339 -0.662433 1.45416
C  -2.405486 0.715541 0.839515
C  -1.232642 1.508528 0.657717
C  -1.351759 2.785005 0.035816
C  4.229238 -1.656938 -0.698521
C  -2.207957 -1.798509 -0.696484
C  -3.618442 1.223903 0.440786
C  0.063888 1.094105 1.05964
C  -2.95048 -2.963892 1.283003
C  -2.621181 3.255301 -0.364836
C  -3.734462 2.490638 -0.157677
C  -0.19372 3.57107 -0.179518
C  4.727722 -0.442304 0.093243
C  4.918816 -1.701946 -2.066227
C  4.532095 -2.941997 0.078768
C  -0.735241 -2.057814 -0.599454
C  1.164733 1.873485 0.835206
C  1.039494 3.127369 0.20463
C  2.780496 -1.536918 -0.885571
C  0.180641 -1.253476 -1.145135
C  1.583878 -1.436336 -1.013856
H  -1.366972 -0.917843 1.801723
H  -2.995782 -0.650711 2.353693
H  -2.682233 -2.606842 -1.26113
H  -2.37526 -0.884352 -1.270939
H  -4.515527 0.636772 0.589317
H  0.200508 0.141068 1.548632
H  -1.973102 -3.307416 1.647322
H  -3.356304 -3.739376 0.632522
H  -3.607267 -2.884139 2.150305
H  -2.697212 4.229683 -0.831949
H  -4.710086 2.852589 -0.454528
H  -0.305957 4.536522 -0.657879
H  4.525507 0.488011 -0.438412
H  5.80588 -0.51658 0.245728
H  4.251881 -0.385636 1.072866
H  5.998719 -1.786445 -1.934312
H  4.583319 -2.558284 -2.651854
H  4.719274 -0.797416 -2.641512
H  5.608667 -3.043045 0.225371
H  4.057505 -2.932174 1.060334
H  4.180995 -3.822662 -0.459829
H  -0.40842 -2.930773 -0.043311
H  2.141253 1.52201 1.143189
H  1.918218 3.73431 0.030989
H  -0.141915 -0.373598 -1.69489
elementType: N C H
totalener: -870.02802124 hartree
nucrepener: 1710.00960739 hartree
electener: -2580.03762863 hartree
oneelecener: -4572.79536562 hartree
twoeener: 1992.75773699 hartree
cpcmener: -0.02125592 hartree
kineticenergy: 865.87962498 hartree
xcener: -89.000521858966 hartree
chargesum: -0.0000000
charge: -0.207508 -0.093176 0.117743 -0.052755 -0.032171 0.101905 -0.067722 -0.204126 -0.263556 -0.207567 -0.145152 -0.144985 -0.089194 -0.322635 -0.292281 -0.292616 -0.104042 -0.132586 -0.176615 -0.317752 -0.263239 0.240366 0.109556 0.117921 0.109694 0.097502 0.127382 0.151487 0.081862 0.102969 0.100869 0.144549 0.157869 0.142827 0.103399 0.104292 0.103647 0.098072 0.101366 0.100874 0.096939 0.100698 0.101045 0.132087 0.169532 0.158746 0.134481
qa: -0.2075 -0.0932 0.1177 -0.0528 -0.0322 0.1019 -0.0677 -0.2041 -0.2636 -0.2076 -0.1452 -0.1450 -0.0892 -0.3226 -0.2923 -0.2926 -0.1040 -0.1326 -0.1766 -0.3178 -0.2632 0.2404 0.1096 0.1179 0.1097 0.0975 0.1274 0.1515 0.0819 0.1030 0.1009 0.1445 0.1579 0.1428 0.1034 0.1043 0.1036 0.0981 0.1014 0.1009 0.0969 0.1007 0.1010 0.1321 0.1695 0.1587 0.1345
va: 2.8555 3.8413 3.4476 3.6817 3.8683 3.9858 3.9776 3.9469 3.9014 3.9540 3.9211 3.9041 3.8662 3.9054 3.8943 3.8930 3.7241 3.8668 3.9447 4.1003 3.9760 3.6109 0.9999 0.9954 0.9967 1.0014 1.0267 1.0097 0.9942 0.9962 0.9950 1.0047 0.9904 1.0049 1.0034 1.0053 1.0027 1.0030 1.0055 1.0051 1.0037 1.0055 1.0055 1.0096 0.9849 0.9909 0.9990
dispcorr: -0.023223097 hartree
energy: -870.051244341945
dipole: 15.97960 -15.48415 0.49545 -14.89220 14.55044 -0.34176 0.28854 0.00286 0.29141
magnitude: 0.66872 au
magnitude: 1.69975 debye
