program: Orca
programVersion: 5.0.2
elementType: N C C C C C C C C C C C C C C C C C C C C C H H H H H H H H H H H H H H H H H H H H H H H H H
charge: 0
multiplicity: 1
keywords: wb97x-d3
keywords: def2-TZVPP
keywords: def2/J RIJCOSX
keywords: DEFGRID2
keywords: scfconv7
keywords: smallprint printgap noloewdin
keywords: NOSOSCF
formula: C21H25N
InChI: InChI=1/C21H25N/c1-21(2,3)15-8-5-9-16-22(4)17-19-13-10-12-18-11-6-7-14-20(18)19/h5-7,9-14H,16-17H2,1-4H3
47 atoms
N  -1.205326 -0.587117 0.371745
C  -2.63204 -0.324353 0.234745
C  -3.047158 1.004757 0.804761
C  -2.621734 2.229776 0.210743
C  -3.026625 3.461204 0.795086
C  5.412068 -3.102944 -1.057467
C  -0.832106 -1.770394 -0.389546
C  -3.857868 1.047175 1.910114
C  -1.820358 2.275753 -0.956314
C  -0.82847 -0.732424 1.763518
C  -3.860225 3.451363 1.938196
C  -4.274391 2.267757 2.478437
C  -2.597279 4.679982 0.218981
C  6.157961 -2.784303 0.243763
C  5.768236 -2.064955 -2.127552
C  5.797505 -4.50282 -1.545882
C  0.641377 -1.849127 -0.610329
C  -1.428818 3.470661 -1.49711
C  -1.812614 4.687773 -0.900675
C  3.970169 -3.053509 -0.800182
C  1.389769 -2.914144 -0.31067
C  2.784831 -2.988057 -0.578637
H  -3.233684 -1.112788 0.713936
H  -2.881396 -0.356322 -0.829529
H  -1.19809 -2.699884 0.075504
H  -1.312179 -1.703344 -1.37122
H  -4.185304 0.118031 2.361301
H  -1.50882 1.354329 -1.427351
H  -1.35994 -1.553204 2.268547
H  -1.030197 0.185275 2.315504
H  0.240801 -0.927769 1.846992
H  -4.167792 4.395587 2.371207
H  -4.919179 2.258525 3.34752
H  -2.904791 5.610538 0.68079
H  7.235664 -2.816338 0.074271
H  5.917385 -3.50635 1.02477
H  5.903125 -1.789669 0.611455
H  6.842003 -2.084193 -2.322097
H  5.252357 -2.270232 -3.06633
H  5.50211 -1.056855 -1.807833
H  6.872931 -4.548728 -1.726523
H  5.546823 -5.264975 -0.807394
H  5.289117 -4.752571 -2.477869
H  1.105935 -0.984236 -1.073553
H  -0.816901 3.48248 -2.389596
H  -1.488066 5.62481 -1.333802
H  0.933372 -3.781812 0.157873
elementType: N C H
totalener: -870.03140585 hartree
nucrepener: 1587.31668749 hartree
electener: -2457.34809334 hartree
oneelecener: -4327.30334182 hartree
twoeener: 1869.95524848 hartree
cpcmener: -0.02194415 hartree
kineticenergy: 865.86878051 hartree
xcener: -88.992106211043 hartree
chargesum: 0.0000000
charge: -0.226158 -0.028814 0.048317 -0.084876 -0.039535 0.070333 -0.038796 -0.126666 -0.245568 -0.216338 -0.150317 -0.145612 -0.099612 -0.290757 -0.291925 -0.290332 -0.133244 -0.157182 -0.158847 -0.318800 -0.222439 0.237303 0.103176 0.116467 0.095865 0.102674 0.133266 0.141832 0.083926 0.105456 0.109452 0.144194 0.157994 0.144478 0.096913 0.100705 0.101252 0.097487 0.100683 0.100307 0.097485 0.100397 0.100672 0.122150 0.157985 0.159635 0.135414
qa: -0.2262 -0.0288 0.0483 -0.0849 -0.0395 0.0703 -0.0388 -0.1267 -0.2456 -0.2163 -0.1503 -0.1456 -0.0996 -0.2908 -0.2919 -0.2903 -0.1332 -0.1572 -0.1588 -0.3188 -0.2224 0.2373 0.1032 0.1165 0.0959 0.1027 0.1333 0.1418 0.0839 0.1055 0.1095 0.1442 0.1580 0.1445 0.0969 0.1007 0.1013 0.0975 0.1007 0.1003 0.0975 0.1004 0.1007 0.1221 0.1580 0.1596 0.1354
va: 2.7824 3.7149 3.5031 3.8456 3.8511 4.0235 3.8892 3.8829 3.9865 3.9615 3.9229 3.9063 3.8659 3.8949 3.8931 3.8939 3.8956 3.9294 3.9016 4.1102 4.0225 3.6547 1.0115 0.9939 1.0129 0.9984 1.0112 1.0256 1.0056 0.9926 0.9965 1.0047 0.9908 1.0046 1.0035 1.0057 1.0052 1.0031 1.0057 1.0059 1.0031 1.0056 1.0057 1.0217 0.9926 0.9894 1.0060
dispcorr: -0.019214142 hartree
energy: -870.050619995337
dipole: 24.01671 -24.11232 -0.09561 -17.32854 17.00647 -0.32208 -2.63241 2.68377 0.05136
magnitude: 0.33987 au
magnitude: 0.86389 debye
