program: Orca
programVersion: 5.0.2
elementType: N C C C C C C C C C C C C C C C C C C C C C H H H H H H H H H H H H H H H H H H H H H H H H H
charge: 0
multiplicity: 1
keywords: wb97x-d3
keywords: def2-TZVPP
keywords: def2/J RIJCOSX
keywords: DEFGRID2
keywords: scfconv7
keywords: smallprint printgap noloewdin
keywords: NOSOSCF
formula: C21H25N
InChI: InChI=1/C21H25N/c1-21(2,3)15-8-5-9-16-22(4)17-19-13-10-12-18-11-6-7-14-20(18)19/h5-7,9-14H,16-17H2,1-4H3
47 atoms
N  -3.284247 -1.141935 0.553389
C  -3.431418 -0.009967 -0.358422
C  -2.139702 0.64767 -0.756438
C  -1.325426 1.336803 0.188677
C  -0.071441 1.860831 -0.228587
C  3.938745 -0.928024 -0.017958
C  -2.372771 -2.160537 0.047576
C  -1.720499 0.56251 -2.059243
C  -1.711761 1.523702 1.538027
C  -4.598212 -1.707907 0.797398
C  0.332815 1.714928 -1.576063
C  -0.485012 1.09368 -2.476665
C  0.752092 2.527097 0.709492
C  4.768231 -1.323433 -1.243683
C  4.512084 -1.595848 1.235886
C  3.960188 0.595815 0.153043
C  -0.934395 -1.829462 0.283448
C  -0.897192 2.17896 2.421995
C  0.35281 2.680213 2.008285
C  2.551422 -1.359875 -0.214102
C  0.034049 -2.000277 -0.620131
C  1.397166 -1.67426 -0.381012
H  -4.0895 0.719045 0.123678
H  -3.946714 -0.321542 -1.280736
H  -2.587388 -3.081082 0.599973
H  -2.54514 -2.39687 -1.014322
H  -2.339493 0.045155 -2.782365
H  -2.665513 1.147598 1.878025
H  -5.261882 -0.943792 1.204255
H  -4.534706 -2.512237 1.530508
H  -5.075175 -2.112523 -0.10714
H  1.293986 2.111118 -1.881572
H  -0.182998 0.993102 -3.510924
H  1.70565 2.920355 0.378153
H  4.771351 -2.404219 -1.389739
H  5.801952 -0.997985 -1.113978
H  4.380507 -0.859025 -2.151194
H  5.541809 -1.270078 1.393185
H  3.935754 -1.332416 2.12354
H  4.513661 -2.682402 1.142184
H  4.986795 0.941329 0.288473
H  3.547536 1.098392 -0.723018
H  3.382807 0.904078 1.025443
H  -0.681253 -1.460556 1.272271
H  -1.214008 2.312991 3.448036
H  0.989719 3.191357 2.718336
H  -0.214545 -2.360597 -1.614562
elementType: N C H
totalener: -870.02852937 hartree
nucrepener: 1764.70184868 hartree
electener: -2634.73037805 hartree
oneelecener: -4682.90874476 hartree
twoeener: 2048.17836671 hartree
cpcmener: -0.02392264 hartree
kineticenergy: 865.87775931 hartree
xcener: -88.998505865390 hartree
chargesum: -0.0000000
charge: -0.223759 -0.068274 0.196965 -0.103031 0.025748 0.123716 -0.072448 -0.186015 -0.265493 -0.205059 -0.234740 -0.101601 -0.145926 -0.292448 -0.291244 -0.327498 -0.045431 -0.150396 -0.144369 -0.325959 -0.300917 0.230332 0.115997 0.109365 0.107053 0.094786 0.127805 0.138125 0.100895 0.100491 0.081903 0.145391 0.157005 0.153970 0.100728 0.097757 0.100311 0.098227 0.100471 0.100678 0.108062 0.099072 0.100163 0.118440 0.158533 0.160033 0.132587
qa: -0.2238 -0.0683 0.1970 -0.1030 0.0257 0.1237 -0.0724 -0.1860 -0.2655 -0.2051 -0.2347 -0.1016 -0.1459 -0.2924 -0.2912 -0.3275 -0.0454 -0.1504 -0.1444 -0.3260 -0.3009 0.2303 0.1160 0.1094 0.1071 0.0948 0.1278 0.1381 0.1009 0.1005 0.0819 0.1454 0.1570 0.1540 0.1007 0.0978 0.1003 0.0982 0.1005 0.1007 0.1081 0.0991 0.1002 0.1184 0.1585 0.1600 0.1326
va: 2.8108 3.7864 3.3346 3.7942 3.6602 3.9759 3.9536 3.9332 3.9639 3.9460 3.9172 3.8545 3.8545 3.8912 3.8893 3.9170 3.7694 3.9320 3.9134 4.0813 4.0220 3.6790 0.9940 1.0062 0.9938 1.0117 1.0121 1.0298 0.9951 0.9970 0.9985 1.0066 0.9901 0.9951 1.0060 1.0032 1.0053 1.0032 1.0055 1.0061 1.0076 1.0034 1.0025 1.0186 0.9909 0.9893 1.0072
dispcorr: -0.025243886 hartree
energy: -870.053773254262
dipole: 9.02289 -9.35573 -0.33284 -7.93759 7.84417 -0.09342 1.24337 -1.48265 -0.23928
magnitude: 0.42044 au
magnitude: 1.06867 debye
