program: Orca
programVersion: 5.0.2
elementType: N C C C C C C C C C C C C C C C C C C C C C H H H H H H H H H H H H H H H H H H H H H H H H H
charge: 0
multiplicity: 1
keywords: wb97x-d3
keywords: def2-TZVPP
keywords: def2/J RIJCOSX
keywords: DEFGRID2
keywords: scfconv7
keywords: smallprint printgap noloewdin
keywords: NOSOSCF
formula: C21H25N
InChI: InChI=1/C21H25N/c1-21(2,3)15-8-5-9-16-22(4)17-19-13-10-12-18-11-6-7-14-20(18)19/h5-7,9-14H,16-17H2,1-4H3
47 atoms
N  -1.859641 -0.988607 1.073551
C  -1.765579 -0.471763 -0.28752
C  -2.408311 0.873872 -0.477662
C  -1.880952 2.045587 0.141076
C  -2.525282 3.294214 -0.078054
C  4.981883 -2.505675 -0.82902
C  -1.132409 -2.247192 1.175894
C  -3.509738 0.987103 -1.287556
C  -0.723179 2.024476 0.956953
C  -3.242926 -1.193197 1.458178
C  -3.659294 3.357979 -0.921753
C  -4.136964 2.227343 -1.519764
C  -2.014863 4.458448 0.542617
C  5.619807 -1.478337 0.111932
C  5.117912 -2.033967 -2.281598
C  5.672492 -3.863575 -0.661325
C  0.326835 -2.087857 0.907023
C  -0.24705 3.169594 1.53639
C  -0.903498 4.399757 1.336916
C  3.560192 -2.638511 -0.499452
C  0.995555 -2.851344 0.038034
C  2.386309 -2.72953 -0.23067
H  -2.216057 -1.175893 -1.005901
H  -0.708308 -0.401995 -0.557044
H  -1.260123 -2.619826 2.197366
H  -1.548199 -3.018919 0.507525
H  -3.90856 0.099314 -1.76363
H  -0.208405 1.089753 1.12918
H  -3.288316 -1.594254 2.471149
H  -3.777421 -1.890122 0.795377
H  -3.78803 -0.249896 1.45804
H  -4.134992 4.316679 -1.089798
H  -4.998451 2.274778 -2.173012
H  -2.520691 5.401684 0.374628
H  5.149212 -0.500107 0.007406
H  6.680547 -1.369018 -0.120364
H  5.532789 -1.787653 1.154068
H  4.635751 -1.06758 -2.432759
H  6.172907 -1.928957 -2.540922
H  4.670863 -2.748542 -2.973672
H  6.731728 -3.773525 -0.908347
H  5.594862 -4.224986 0.364591
H  5.236401 -4.615113 -1.320416
H  0.850515 -1.318314 1.466579
H  0.639304 3.131211 2.156144
H  -0.522324 5.295797 1.808988
H  0.461545 -3.613844 -0.522918
elementType: N C H
totalener: -870.03173024 hartree
nucrepener: 1619.37767242 hartree
electener: -2489.40940266 hartree
oneelecener: -4391.40697930 hartree
twoeener: 1901.99757664 hartree
cpcmener: -0.02142188 hartree
kineticenergy: 865.86731330 hartree
xcener: -88.992589799598 hartree
chargesum: -0.0000000
charge: -0.214007 -0.041541 0.041148 -0.061298 -0.050316 0.069181 -0.080367 -0.116954 -0.252105 -0.218191 -0.139572 -0.155640 -0.101091 -0.291499 -0.291424 -0.292032 -0.101444 -0.156760 -0.159517 -0.311100 -0.242349 0.241566 0.105604 0.124023 0.104734 0.086393 0.131892 0.145963 0.105697 0.085137 0.105018 0.144787 0.157615 0.144251 0.100439 0.096864 0.100688 0.101420 0.097288 0.101041 0.097717 0.101131 0.100957 0.136175 0.157102 0.159227 0.134149
qa: -0.2140 -0.0415 0.0411 -0.0613 -0.0503 0.0692 -0.0804 -0.1170 -0.2521 -0.2182 -0.1396 -0.1556 -0.1011 -0.2915 -0.2914 -0.2920 -0.1014 -0.1568 -0.1595 -0.3111 -0.2423 0.2416 0.1056 0.1240 0.1047 0.0864 0.1319 0.1460 0.1057 0.0851 0.1050 0.1448 0.1576 0.1443 0.1004 0.0969 0.1007 0.1014 0.0973 0.1010 0.0977 0.1011 0.1010 0.1362 0.1571 0.1592 0.1341
va: 2.8190 3.6852 3.4694 3.8154 3.8717 4.0212 3.9681 3.8855 3.9835 3.9634 3.9157 3.9198 3.8669 3.8934 3.8950 3.8947 3.8454 3.9352 3.8992 4.1091 4.0338 3.6616 1.0152 0.9921 0.9952 1.0105 1.0126 1.0257 0.9978 1.0025 0.9912 1.0043 0.9913 1.0048 1.0057 1.0036 1.0055 1.0054 1.0033 1.0055 1.0030 1.0055 1.0056 1.0149 0.9926 0.9895 1.0067
dispcorr: -0.019681424 hartree
energy: -870.051411663853
dipole: 18.28463 -18.31728 -0.03264 -15.49798 15.17818 -0.31980 -1.66475 1.43956 -0.22519
magnitude: 0.39249 au
magnitude: 0.99763 debye
