program: Orca
programVersion: 5.0.2
elementType: N C C C C C C C C C C C C C C C C C C C C C H H H H H H H H H H H H H H H H H H H H H H H H H
charge: 0
multiplicity: 1
keywords: wb97x-d3
keywords: def2-TZVPP
keywords: def2/J RIJCOSX
keywords: DEFGRID2
keywords: scfconv7
keywords: smallprint printgap noloewdin
keywords: NOSOSCF
formula: C21H25N
InChI: InChI=1/C21H25N/c1-21(2,3)15-8-5-9-16-22(4)17-19-13-10-12-18-11-6-7-14-20(18)19/h5-7,9-14H,16-17H2,1-4H3
47 atoms
N  -2.0287 -1.158391 0.566358
C  -1.815646 -0.254608 -0.559461
C  -2.388805 1.1186 -0.344324
C  -1.786717 2.044366 0.558287
C  -2.379719 3.32426 0.735848
C  4.952441 -2.456416 -1.112117
C  -1.339619 -2.419286 0.325961
C  -3.513547 1.496284 -1.032614
C  -0.60437 1.750414 1.280854
C  -3.442304 -1.410021 0.76793
C  -3.546227 3.661286 0.010349
C  -4.097444 2.766779 -0.861631
C  -1.789686 4.247588 1.630978
C  5.523249 -3.865174 -1.309214
C  5.576717 -1.813934 0.129958
C  5.254405 -1.59911 -2.346261
C  0.143526 -2.265431 0.272059
C  -0.052446 2.666918 2.134751
C  -0.65275 3.928069 2.319011
C  3.499048 -2.546038 -0.941832
C  0.884067 -2.721372 -0.742112
C  2.299567 -2.616681 -0.820046
H  -2.247716 -0.67152 -1.483639
H  -0.741214 -0.175651 -0.74094
H  -1.587007 -3.091427 1.153637
H  -1.693391 -2.914168 -0.59333
H  -3.968658 0.796741 -1.723642
H  -0.123478 0.789781 1.158124
H  -3.578961 -2.106222 1.595841
H  -3.937068 -1.838909 -0.116506
H  -3.966777 -0.491518 1.028011
H  -3.989015 4.639476 0.153488
H  -4.985563 3.025562 -1.422772
H  -2.254991 5.217337 1.759914
H  5.323774 -4.498458 -0.444298
H  6.604798 -3.812238 -1.446203
H  5.094999 -4.346631 -2.189118
H  5.189415 -0.808014 0.294955
H  5.379853 -2.404726 1.025084
H  6.658603 -1.742373 0.005342
H  4.817168 -2.031394 -3.246965
H  4.864368 -0.587233 -2.231448
H  6.333536 -1.529948 -2.494757
H  0.622167 -1.775358 1.114383
H  0.852553 2.421163 2.674388
H  -0.209135 4.64146 3.001003
H  0.391234 -3.198415 -1.585001
elementType: N C H
totalener: -870.03271437 hartree
nucrepener: 1619.08031117 hartree
electener: -2489.11302554 hartree
oneelecener: -4390.83418417 hartree
twoeener: 1901.72115863 hartree
cpcmener: -0.02188673 hartree
kineticenergy: 865.87625535 hartree
xcener: -88.994262823552 hartree
chargesum: 0.0000000
charge: -0.215118 -0.040521 0.052949 -0.064220 -0.044196 0.068697 -0.075186 -0.139473 -0.248634 -0.222109 -0.142463 -0.148069 -0.103413 -0.291709 -0.291812 -0.291994 -0.101487 -0.160047 -0.160036 -0.302071 -0.247019 0.240401 0.107928 0.120042 0.104691 0.087184 0.133365 0.151449 0.106684 0.084784 0.106682 0.144737 0.157834 0.143947 0.100612 0.097836 0.100725 0.100960 0.100528 0.097598 0.100589 0.101300 0.097288 0.130206 0.157460 0.160133 0.132968
qa: -0.2151 -0.0405 0.0529 -0.0642 -0.0442 0.0687 -0.0752 -0.1395 -0.2486 -0.2221 -0.1425 -0.1481 -0.1034 -0.2917 -0.2918 -0.2920 -0.1015 -0.1600 -0.1600 -0.3021 -0.2470 0.2404 0.1079 0.1200 0.1047 0.0872 0.1334 0.1514 0.1067 0.0848 0.1067 0.1447 0.1578 0.1439 0.1006 0.0978 0.1007 0.1010 0.1005 0.0976 0.1006 0.1013 0.0973 0.1302 0.1575 0.1601 0.1330
va: 2.8105 3.6979 3.4445 3.8295 3.8587 4.0203 3.9554 3.8946 3.9910 3.9653 3.9194 3.9115 3.8680 3.8953 3.8930 3.8954 3.8464 3.9380 3.8976 4.1064 4.0330 3.6684 1.0152 0.9910 0.9957 1.0107 1.0116 1.0076 0.9981 1.0018 0.9906 1.0041 0.9907 1.0049 1.0058 1.0030 1.0053 1.0056 1.0057 1.0031 1.0055 1.0055 1.0031 1.0169 0.9924 0.9892 1.0077
dispcorr: -0.019656576 hartree
energy: -870.052370945911
dipole: 17.73117 -17.76267 -0.03150 -15.77091 15.50233 -0.26858 -4.80337 4.46280 -0.34057
magnitude: 0.43487 au
magnitude: 1.10536 debye
