program: Gaussian 09
title: 000068688
version: EM64L-G09RevD.01
frameworkgroup: C1[X(C12H14ClNO4)]
method: RPBEPBE
basis: SDD
operation: Freq
keyword: #p
keyword: freq=noraman
keyword: PBEPBE/SDD
title: #p freq=noraman PBEPBE/SDD
converged: YES YES NO NO
title: Mulliken charges:
elementType: Cl O O O O N C C C C C C C C C C C C H H H H H H H H H H H H H H
charge: -0.068199 -0.261102 -0.461668 -0.236395 -0.472701 -0.211236 -0.475758 -0.131480 0.355815 -0.003392 0.228487 0.169765 -0.694395 -0.368817 -0.241512 -0.338876 -0.161932 -0.242856 0.267107 0.238703 0.253757 0.225979 0.220014 0.199110 0.233978 0.228533 0.241455 0.259028 0.258408 0.259154 0.368846 0.362180
chargesum: 0.00000
title: Mulliken charges with hydrogens summed into heavy atoms:
elementType: Cl O O O O N C C C C C C C C C C C C
charge: -0.068199 -0.261102 -0.092822 -0.236395 -0.110521 -0.211236 0.030052 0.122277 0.355815 0.222587 0.228487 0.169765 0.009571 0.050307 0.017516 -0.080468 -0.161932 0.016298
polarizability: 2.04319210e+02 2.17468610e+01 1.88211587e+02 -1.02194455e+01 8.56185609e+00 9.43526299e+01
1716.lowfreq: -11.8501 -4.2415 0.0015 0.0017 0.0029 4.3582 20.4024 36.7724 48.2375
frequency: 19.4412 36.6651 48.2186 61.8220 96.8330 114.9984 137.7652 154.6731 172.7730 178.0946 217.3089 249.2804 262.5003 292.6556 298.9367 313.5455 346.1056 349.4072 382.2851 430.1136 444.0218 453.9672 462.6319 468.1813 477.6124 535.8817 557.2086 577.4935 604.6303 653.8765 701.0615 717.6421 743.6050 803.7213 815.5897 829.2638 846.3113 859.0307 900.0953 933.1261 949.2489 963.5824 1015.5404 1024.4065 1049.8152 1060.1669 1078.3410 1084.1886 1101.4017 1114.8915 1154.8737 1177.8564 1191.5133 1211.7069 1243.1132 1249.2831 1276.7055 1283.8629 1303.8909 1306.1072 1327.8474 1347.9530 1364.3098 1389.5527 1393.2246 1393.7464 1408.5913 1426.0935 1457.3647 1458.1520 1467.9185 1470.6106 1485.7228 1575.3693 1606.6363 1624.4201 2954.3265 2956.9862 2963.8528 3012.4263 3016.9829 3023.5094 3083.5050 3115.1509 3123.2306 3164.6332 3184.8559 3190.7211 3520.9641 3595.7560
redmass: 4.3127 6.2479 5.1160 4.7556 5.7684 5.1182 4.4617 5.4406 1.5868 2.2963 4.7754 3.0555 1.1389 5.2943 7.3816 5.7086 4.8391 5.0607 3.9563 4.5710 5.2802 4.1392 1.3581 1.8450 4.0435 3.4297 5.3038 4.7955 4.6933 6.1114 6.5104 4.1889 3.9079 1.8859 2.4533 3.2087 1.4623 3.2433 2.6741 1.3409 2.3729 5.5664 2.7292 2.1020 2.8273 2.6046 2.1480 2.1336 2.1443 1.6213 1.8398 1.5959 1.2742 1.7606 1.2857 1.6417 1.2571 2.1461 1.3954 1.5823 1.7201 2.1631 1.3047 3.3552 1.5329 1.4083 1.6457 2.6785 1.0764 1.0659 1.1034 1.0662 3.3003 7.7705 8.9515 8.9587 1.0829 1.0550 1.0834 1.0357 1.0615 1.1061 1.1027 1.1013 1.0997 1.0887 1.0970 1.0919 1.0650 1.0669
irintensity: 3.8584 2.0914 0.9116 2.2953 3.9649 2.9066 1.8442 0.8510 0.8748 1.0854 1.8275 9.2706 130.6485 2.8551 6.0364 3.0586 6.6545 0.4311 5.6688 3.2452 8.1022 12.6426 61.2668 76.8439 28.0856 38.9051 2.3046 17.2196 37.0088 6.3382 18.6707 9.8159 2.1263 25.5637 35.5563 12.5257 21.9950 36.7734 10.6297 1.1815 9.9941 60.2757 64.9875 16.1014 36.7388 20.8182 9.1917 23.1001 34.7086 5.1580 20.7210 1.1399 31.7787 56.6442 83.3497 118.7129 19.6247 61.3158 35.4744 35.6990 16.8886 90.3649 2.4945 4.3198 0.3933 41.8490 9.0956 16.5987 2.9415 14.4201 36.4378 18.8038 228.1905 49.8208 204.1704 129.8647 21.5463 49.6191 31.1674 15.0960 24.1404 55.9340 5.9311 19.8639 10.1775 1.6942 2.7471 1.4930 24.7303 8.9126
temp: 298.150 k
press: 1.00000 atm
elementType: 17 8 8 8 8 7 6 6 6 6 6 6 6 6 6 6 6 6 1 1 1 1 1 1 1 1 1 1 1 1 1 1
symmnumber: 1
zpe: 642952.6 jmol-1
zpe.correction: 0.244888 hartree
zpe.thermalcorrener: 0.262613 hartree
zpe.thermalcorrenthalpy: 0.263557 hartree
zpe.thermalcorrgfe: 0.197765 hartree
zpe.sumelectzpe: -1280.021228 hartree
zpe.sumelectthermal: -1280.003503 hartree
zpe.sumelectthermalent: -1280.002559 hartree
zpe.sumelectthermalfe: -1280.068351 hartree
dipole: 1.8269 -2.3375 -0.3753
dipole: 2.9903
quadrupole: -108.0404 -104.5158 -112.4833
quadrupole: -20.9304 -1.8534 8.8704
quadrupole: 0.3061 3.8307 -4.1368 -20.9304 -1.8534 8.8704
hfenergy: -1280.2661161 hartree
pointgroup: C01 [X(C12H14Cl1N1O4)]
dipole: -1.0637306 0.4784856 -0.1537637 debye
polarizability: 182.6745504|18.9038428|209.6827048|13.7135101|-2.3281052|94.5261715 unknown
InChI: InChI=1S/C12H14ClNO4/c1-7-12(17)14(5-9(16)6-15)10-4-8(13)2-3-11(10)18-7/h2-4,7,9,15-16H,5-6H2,1H3
charge 0 multiplicity 1
32 atoms
Cl 2.104522 4.138877 -0.030993
O  1.981191 -1.874931 0.109951
O  -2.551827 -0.126799 1.14859
O  -1.438035 -2.555455 -0.787958
O  -4.50408 1.785318 0.769528
N  -0.387145 -0.475426 -0.548851
C  -1.593531 0.208541 -1.053365
C  0.668127 -2.482662 0.473922
C  0.784372 0.252102 -0.194789
C  -2.425172 0.860019 0.075998
C  -0.473003 -1.867424 -0.357372
C  1.976333 -0.46992 0.112654
C  0.806144 -3.986536 0.27496
C  -3.816674 1.26575 -0.428812
C  0.843086 1.667481 -0.229179
C  3.188566 0.199055 0.356676
C  2.066462 2.313233 0.024134
C  3.249376 1.609993 0.312612
H  -2.200761 -0.573597 -1.540654
H  -1.310408 0.966461 -1.80579
H  0.466526 -2.237574 1.539807
H  -1.927442 1.771794 0.470312
H  -4.342754 0.375509 -0.830893
H  -3.74146 2.045847 -1.214764
H  1.056253 -4.214634 -0.774204
H  1.602371 -4.379809 0.928482
H  -0.147191 -4.482529 0.517585
H  -0.039099 2.266632 -0.459705
H  4.078913 -0.396986 0.576118
H  4.186495 2.138646 0.503154
H  -3.255188 0.214901 1.762201
H  -5.464168 1.925825 0.581044
