program: Orca
programVersion: 5.0.2
elementType: N C C C C C C C C C C C C C C C C C C C C C H H H H H H H H H H H H H H H H H H H H H H H H H
charge: 0
multiplicity: 1
keywords: wb97x-d3
keywords: def2-TZVPP
keywords: def2/J RIJCOSX
keywords: DEFGRID2
keywords: scfconv7
keywords: smallprint printgap noloewdin
keywords: NOSOSCF
formula: C21H25N
InChI: InChI=1/C21H25N/c1-21(2,3)15-8-5-9-16-22(4)17-19-13-10-12-18-11-6-7-14-20(18)19/h5-7,9-14H,16-17H2,1-4H3
47 atoms
N  -0.380569 0.001147 -0.095758
C  -1.729391 0.49865 -0.292995
C  -2.128486 1.612572 0.644145
C  -3.311672 2.366158 0.376832
C  -3.689124 3.41091 1.263966
C  5.593812 -4.009628 -0.611224
C  -0.22926 -1.296986 -0.740539
C  -1.401528 1.902119 1.770406
C  -4.145086 2.109179 -0.740368
C  0.588955 0.943209 -0.628308
C  -2.897152 3.680134 2.403984
C  -1.781022 2.934656 2.651426
C  -4.856412 4.164262 0.997134
C  6.117879 -4.706137 -1.871206
C  5.438667 -5.031335 0.520173
C  6.570229 -2.908457 -0.182086
C  1.095673 -1.914027 -0.443977
C  -5.272494 2.851164 -0.970034
C  -5.63306 3.894028 -0.095374
C  4.286543 -3.411727 -0.897942
C  1.945738 -2.321239 -1.390495
C  3.204881 -2.921117 -1.115361
H  -2.426853 -0.332324 -0.146791
H  -1.872296 0.824358 -1.33522
H  -1.013129 -1.957283 -0.356049
H  -0.373896 -1.237014 -1.831271
H  -0.509058 1.333225 1.991593
H  -3.900041 1.311131 -1.427603
H  0.447845 1.930162 -0.190736
H  0.51758 1.049493 -1.721294
H  1.604786 0.628848 -0.390129
H  -3.191322 4.4793 3.07346
H  -1.173846 3.132277 3.525291
H  -5.126794 4.961172 1.679448
H  5.441625 -5.496545 -2.19872
H  7.090698 -5.157429 -1.668482
H  6.238533 -4.000345 -2.693775
H  6.405626 -5.484724 0.745455
H  5.066672 -4.560954 1.431032
H  4.749022 -5.829119 0.242529
H  7.546615 -3.343636 0.038462
H  6.70199 -2.165143 -0.96917
H  6.219886 -2.395574 0.714222
H  1.357656 -2.038664 0.602131
H  -5.893568 2.634014 -1.829212
H  -6.524293 4.476375 -0.288997
H  1.683949 -2.189836 -2.436886
elementType: N C H
totalener: -870.03092467 hartree
nucrepener: 1558.70987370 hartree
electener: -2428.74079837 hartree
oneelecener: -4269.83071087 hartree
twoeener: 1841.08991251 hartree
cpcmener: -0.02124690 hartree
kineticenergy: 865.86844597 hartree
xcener: -88.995177259108 hartree
chargesum: 0.0000000
charge: -0.184475 -0.053146 0.149819 -0.129565 0.012663 0.068539 -0.072244 -0.266764 -0.217830 -0.205003 -0.176296 -0.126620 -0.115118 -0.292285 -0.291799 -0.290000 -0.114940 -0.180844 -0.144201 -0.320721 -0.221490 0.242432 0.115243 0.097865 0.102003 0.091002 0.141105 0.145541 0.113783 0.092744 0.107569 0.143708 0.158508 0.143730 0.100542 0.098009 0.100630 0.097556 0.100753 0.100306 0.097876 0.100421 0.101515 0.126835 0.158084 0.160128 0.134431
qa: -0.1845 -0.0531 0.1498 -0.1296 0.0127 0.0685 -0.0722 -0.2668 -0.2178 -0.2050 -0.1763 -0.1266 -0.1151 -0.2923 -0.2918 -0.2900 -0.1149 -0.1808 -0.1442 -0.3207 -0.2215 0.2424 0.1152 0.0979 0.1020 0.0910 0.1411 0.1455 0.1138 0.0927 0.1076 0.1437 0.1585 0.1437 0.1005 0.0980 0.1006 0.0976 0.1008 0.1003 0.0979 0.1004 0.1015 0.1268 0.1581 0.1601 0.1344
va: 2.8839 3.8923 3.4190 3.9576 3.7899 4.0256 3.9368 3.9565 3.9632 3.8977 3.9450 3.9098 3.8798 3.8932 3.8926 3.8916 3.8514 3.9381 3.8910 4.1132 4.0202 3.6513 0.9927 0.9992 1.0006 1.0080 1.0375 1.0092 0.9944 1.0077 0.9979 1.0053 0.9911 1.0055 1.0058 1.0029 1.0057 1.0032 1.0058 1.0060 1.0030 1.0061 1.0053 1.0195 0.9931 0.9890 1.0071
dispcorr: -0.018451699 hartree
energy: -870.049376368938
dipole: 27.49709 -27.41919 0.07790 -18.43715 18.28485 -0.15230 -5.18211 4.76251 -0.41960
magnitude: 0.45313 au
magnitude: 1.15177 debye
