program: Orca
programVersion: 5.0.2
elementType: N C C C C C C C C C C C C C C C C C C C C C H H H H H H H H H H H H H H H H H H H H H H H H H
charge: 0
multiplicity: 1
keywords: wb97x-d3
keywords: def2-TZVPP
keywords: def2/J RIJCOSX
keywords: DEFGRID2
keywords: scfconv7
keywords: smallprint printgap noloewdin
keywords: NOSOSCF
formula: C21H25N
InChI: InChI=1/C21H25N/c1-21(2,3)15-8-5-9-16-22(4)17-19-13-10-12-18-11-6-7-14-20(18)19/h5-7,9-14H,16-17H2,1-4H3
47 atoms
N  -3.495065 -1.392066 -0.132798
C  -3.503053 0.047858 0.103157
C  -2.258932 0.652545 0.72077
C  -1.270414 1.335474 -0.050702
C  -0.080479 1.784785 0.587923
C  3.785029 -0.955116 -0.014658
C  -2.485688 -1.863397 -1.066082
C  -2.057738 0.512146 2.073851
C  -1.401899 1.576471 -1.440802
C  -3.557708 -2.194154 1.070524
C  0.093906 1.57637 1.974765
C  -0.884482 0.964724 2.705723
C  0.924302 2.427924 -0.174113
C  3.732006 -0.008994 1.190489
C  4.649963 -0.338032 -1.118265
C  4.37116 -2.304925 0.413927
C  -1.060978 -1.807452 -0.598546
C  -0.415444 2.203702 -2.151744
C  0.767122 2.630692 -1.516055
C  2.425153 -1.156921 -0.523486
C  -0.045872 -1.426538 -1.378517
C  1.294127 -1.310946 -0.918911
H  -4.347577 0.252506 0.764995
H  -3.74447 0.538736 -0.839489
H  -2.731934 -2.904825 -1.301869
H  -2.583265 -1.30972 -2.003747
H  -2.822603 0.039171 2.677746
H  -2.289631 1.25178 -1.96509
H  -4.410297 -1.884197 1.676401
H  -2.670611 -2.157242 1.714491
H  -3.713238 -3.239406 0.79728
H  1.007321 1.917983 2.446887
H  -0.763597 0.821504 3.771585
H  1.825731 2.757234 0.32899
H  4.735616 0.133427 1.595606
H  3.101449 -0.410161 1.984943
H  3.341683 0.969674 0.908595
H  5.664788 -0.176782 -0.750095
H  4.707421 -0.991203 -1.989737
H  4.251373 0.624681 -1.440996
H  3.77579 -2.761505 1.205395
H  4.414856 -3.002358 -0.423333
H  5.385933 -2.167698 0.7919
H  -0.854913 -2.097661 0.426928
H  -0.542901 2.37034 -3.213495
H  1.542639 3.120063 -2.090517
H  -0.236527 -1.127829 -2.405512
elementType: N C H
totalener: -870.02590273 hartree
nucrepener: 1783.46798976 hartree
electener: -2653.49389249 hartree
oneelecener: -4720.09531627 hartree
twoeener: 2066.60142378 hartree
cpcmener: -0.02464692 hartree
kineticenergy: 865.88258625 hartree
xcener: -89.005823127065 hartree
chargesum: -0.0000000
charge: -0.206845 -0.111694 0.086898 0.027693 -0.025757 0.112137 -0.075440 -0.186911 -0.255652 -0.222593 -0.181999 -0.137401 -0.155267 -0.319521 -0.289505 -0.290826 -0.053056 -0.135006 -0.154194 -0.359878 -0.289027 0.266135 0.115919 0.114015 0.109873 0.102308 0.151810 0.139738 0.104151 0.084667 0.107580 0.148722 0.157932 0.155196 0.107604 0.103424 0.095083 0.098232 0.100900 0.096832 0.100453 0.100797 0.097432 0.122310 0.156888 0.158336 0.127502
qa: -0.2068 -0.1117 0.0869 0.0277 -0.0258 0.1121 -0.0754 -0.1869 -0.2557 -0.2226 -0.1820 -0.1374 -0.1553 -0.3195 -0.2895 -0.2908 -0.0531 -0.1350 -0.1542 -0.3599 -0.2890 0.2661 0.1159 0.1140 0.1099 0.1023 0.1518 0.1397 0.1042 0.0847 0.1076 0.1487 0.1579 0.1552 0.1076 0.1034 0.0951 0.0982 0.1009 0.0968 0.1005 0.1008 0.0974 0.1223 0.1569 0.1583 0.1275
va: 2.8889 3.9271 3.2870 3.6330 3.7437 3.9840 3.9705 3.8983 3.9051 3.9591 3.9148 3.9263 3.8330 3.9032 3.8936 3.8888 3.6530 3.8886 3.8959 4.1200 4.0023 3.5558 0.9980 1.0012 0.9939 1.0024 0.9924 1.0133 0.9922 0.9852 0.9987 1.0000 0.9901 0.9969 1.0072 1.0040 1.0072 1.0033 1.0061 1.0066 1.0055 1.0061 1.0034 1.0137 0.9906 0.9902 1.0072
dispcorr: -0.026553874 hartree
energy: -870.052456602202
dipole: 11.32286 -11.15393 0.16893 -8.79135 8.81837 0.02702 2.54254 -2.17685 0.36569
magnitude: 0.40372 au
magnitude: 1.02618 debye
