program: Orca
programVersion: 5.0.2
elementType: N C C C C C C C C C C C C C C C C C C C C C H H H H H H H H H H H H H H H H H H H H H H H H H
charge: 0
multiplicity: 1
keywords: wb97x-d3
keywords: def2-TZVPP
keywords: def2/J RIJCOSX
keywords: DEFGRID2
keywords: scfconv7
keywords: smallprint printgap noloewdin
keywords: NOSOSCF
formula: C21H25N
InChI: InChI=1/C21H25N/c1-21(2,3)15-8-5-9-16-22(4)17-19-13-10-12-18-11-6-7-14-20(18)19/h5-7,9-14H,16-17H2,1-4H3
47 atoms
N  -2.269748 -1.224619 -0.160711
C  -1.915428 -0.670339 1.140686
C  -2.260552 0.786486 1.277522
C  -1.525024 1.786876 0.576042
C  -1.89096 3.151989 0.729263
C  4.655264 -2.086316 -0.881741
C  -1.728541 -2.573681 -0.305092
C  -3.29615 1.168743 2.091554
C  -0.426093 1.478932 -0.263376
C  -3.707856 -1.257674 -0.335331
C  -2.974033 3.494069 1.572651
C  -3.660939 2.521481 2.241171
C  -1.162589 4.14955 0.039071
C  5.025038 -1.308709 0.386609
C  5.233943 -1.378738 -2.110975
C  5.210326 -3.512569 -0.794752
C  -0.232084 -2.608854 -0.199114
C  0.261788 2.466151 -0.915684
C  -0.110301 3.817065 -0.768237
C  3.195684 -2.142339 -1.000195
C  0.574589 -2.209213 -1.186743
C  1.991882 -2.18445 -1.085753
H  -0.840311 -0.79705 1.290127
H  -2.403406 -1.227693 1.956492
H  -2.156533 -3.260555 0.441286
H  -2.035054 -2.949447 -1.284097
H  -3.853917 0.410107 2.62792
H  -0.122151 0.449551 -0.395049
H  -3.951774 -1.687676 -1.306986
H  -4.123114 -0.250786 -0.311669
H  -4.224162 -1.851169 0.433494
H  -3.245461 4.537118 1.681612
H  -4.486062 2.782441 2.890821
H  -1.455215 5.185505 0.161188
H  6.11064 -1.256939 0.487572
H  4.626138 -1.792581 1.278837
H  4.640447 -0.28881 0.352752
H  4.856922 -0.359019 -2.196685
H  6.32152 -1.330439 -2.033275
H  4.985415 -1.911374 -3.029548
H  6.297711 -3.482355 -0.707159
H  4.816333 -4.038974 0.075292
H  4.960282 -4.091403 -1.68446
H  0.203492 -2.957695 0.731179
H  1.097936 2.207401 -1.552057
H  0.437709 4.587064 -1.295342
H  0.14835 -1.868384 -2.12686
elementType: N C H
totalener: -870.02904593 hartree
nucrepener: 1652.31686597 hartree
electener: -2522.34591190 hartree
oneelecener: -4457.49758900 hartree
twoeener: 1935.15167710 hartree
cpcmener: -0.02171287 hartree
kineticenergy: 865.87311637 hartree
xcener: -88.993207603320 hartree
chargesum: -0.0000000
charge: -0.226598 -0.040364 0.029684 -0.085587 -0.027133 0.064048 -0.074186 -0.135909 -0.207107 -0.220759 -0.144094 -0.143012 -0.110035 -0.290958 -0.292270 -0.289772 -0.090796 -0.177498 -0.149445 -0.299781 -0.292726 0.268647 0.122745 0.109041 0.095449 0.101010 0.134032 0.136004 0.106589 0.106033 0.083199 0.144560 0.158102 0.143554 0.097441 0.100578 0.100418 0.101268 0.097441 0.100645 0.097845 0.101247 0.100634 0.143891 0.155239 0.159604 0.139085
qa: -0.2266 -0.0404 0.0297 -0.0856 -0.0271 0.0640 -0.0742 -0.1359 -0.2071 -0.2208 -0.1441 -0.1430 -0.1100 -0.2910 -0.2923 -0.2898 -0.0908 -0.1775 -0.1494 -0.2998 -0.2927 0.2686 0.1227 0.1090 0.0954 0.1010 0.1340 0.1360 0.1066 0.1060 0.0832 0.1446 0.1581 0.1436 0.0974 0.1006 0.1004 0.1013 0.0974 0.1006 0.0978 0.1012 0.1006 0.1439 0.1552 0.1596 0.1391
va: 2.7948 3.6986 3.5024 3.8713 3.8417 4.0253 3.9434 3.8927 3.9469 3.9673 3.9245 3.9065 3.8745 3.8915 3.8934 3.8918 3.7818 3.9527 3.8906 4.0955 3.9820 3.6408 0.9925 1.0147 1.0072 0.9963 1.0110 1.0286 0.9976 0.9913 1.0032 1.0047 0.9905 1.0054 1.0033 1.0058 1.0063 1.0057 1.0031 1.0058 1.0031 1.0055 1.0060 0.9996 0.9944 0.9894 1.0057
dispcorr: -0.020540309 hartree
energy: -870.049586238751
dipole: 15.56213 -15.57965 -0.01752 -14.48260 14.10817 -0.37442 -3.03253 3.42089 0.38837
magnitude: 0.53975 au
magnitude: 1.37193 debye
