program: Orca
programVersion: 5.0.2
elementType: N C C C C C C C C C C C C C C C C C C C C C H H H H H H H H H H H H H H H H H H H H H H H H H
charge: 0
multiplicity: 1
keywords: wb97x-d3
keywords: def2-TZVPP
keywords: def2/J RIJCOSX
keywords: DEFGRID2
keywords: scfconv7
keywords: smallprint printgap noloewdin
keywords: NOSOSCF
formula: C21H25N
InChI: InChI=1/C21H25N/c1-21(2,3)15-8-5-9-16-22(4)17-19-13-10-12-18-11-6-7-14-20(18)19/h5-7,9-14H,16-17H2,1-4H3
47 atoms
N  -0.729184 0.324598 -0.843251
C  -1.198653 0.086938 0.511794
C  -1.815485 1.312569 1.132565
C  -3.023653 1.874648 0.624286
C  -3.553806 3.044249 1.233708
C  5.328577 -3.609551 -0.434922
C  -0.417645 -0.90273 -1.560052
C  -1.204697 1.907212 2.206437
C  -3.734098 1.306042 -0.461359
C  0.338911 1.297654 -0.907348
C  -2.882001 3.623573 2.335731
C  -1.734568 3.061728 2.816039
C  -4.750328 3.609077 0.733248
C  6.29115 -3.783921 -1.614201
C  5.002952 -4.977232 0.175883
C  5.967586 -2.707621 0.627942
C  0.781538 -1.648401 -1.05065
C  -4.894026 1.870569 -0.918483
C  -5.406478 3.039142 -0.321861
C  4.091621 -2.981965 -0.910726
C  1.905558 -1.792474 -1.759101
C  3.073877 -2.452117 -1.287266
H  -0.396291 -0.263322 1.179258
H  -1.938205 -0.719306 0.473987
H  -1.29869 -1.55064 -1.511865
H  -0.267353 -0.654442 -2.614628
H  -0.287714 1.480852 2.596328
H  -3.35569 0.414625 -0.941459
H  -0.013347 2.271776 -0.565543
H  0.664132 1.41823 -1.942046
H  1.223809 1.037503 -0.308464
H  -3.293934 4.514978 2.793582
H  -1.222056 3.501082 3.662123
H  -5.141469 4.503234 1.204422
H  5.862452 -4.423802 -2.386755
H  7.220252 -4.245288 -1.273733
H  6.539868 -2.82468 -2.070388
H  5.916352 -5.449567 0.542645
H  4.312547 -4.884333 1.015283
H  4.552183 -5.6446 -0.559942
H  6.893837 -3.156534 0.992242
H  6.207391 -1.72371 0.222633
H  5.303383 -2.568129 1.481834
H  0.729441 -2.063509 -0.048489
H  -5.421004 1.419423 -1.749708
H  -6.320832 3.479759 -0.698022
H  1.959762 -1.376797 -2.762537
elementType: N C H
totalener: -870.04421724 hartree
nucrepener: 1591.03134518 hartree
electener: -2461.07556242 hartree
oneelecener: -4334.55708509 hartree
twoeener: 1873.48152267 hartree
cpcmener: -0.01918117 hartree
kineticenergy: 865.85603239 hartree
xcener: -88.992494350670 hartree
chargesum: -0.0000000
charge: -0.212969 -0.034752 0.026936 -0.072968 -0.038130 0.061939 -0.050735 -0.112322 -0.244013 -0.222247 -0.141512 -0.148541 -0.098104 -0.290147 -0.287854 -0.288069 -0.138914 -0.154275 -0.154273 -0.310925 -0.224312 0.247592 0.100619 0.117655 0.096256 0.101600 0.129693 0.145489 0.109833 0.108150 0.084043 0.140507 0.154381 0.140232 0.100398 0.096323 0.100418 0.096063 0.100295 0.100348 0.095786 0.100591 0.100723 0.130715 0.153665 0.155614 0.129200
qa: -0.2130 -0.0348 0.0269 -0.0730 -0.0381 0.0619 -0.0507 -0.1123 -0.2440 -0.2222 -0.1415 -0.1485 -0.0981 -0.2901 -0.2879 -0.2881 -0.1389 -0.1543 -0.1543 -0.3109 -0.2243 0.2476 0.1006 0.1177 0.0963 0.1016 0.1297 0.1455 0.1098 0.1081 0.0840 0.1405 0.1544 0.1402 0.1004 0.0963 0.1004 0.0961 0.1003 0.1003 0.0958 0.1006 0.1007 0.1307 0.1537 0.1556 0.1292
va: 2.7983 3.7569 3.5291 3.8501 3.8582 4.0365 3.9636 3.8807 3.9954 3.9651 3.9249 3.9219 3.8750 3.8938 3.8923 3.8933 3.7748 3.9376 3.9089 4.0942 3.9829 3.6414 1.0071 0.9925 1.0013 1.0021 1.0117 1.0172 0.9909 0.9957 0.9940 1.0057 0.9924 1.0058 1.0062 1.0033 1.0059 1.0035 1.0061 1.0062 1.0034 1.0061 1.0060 1.0128 0.9941 0.9908 1.0068
dispcorr: -0.019672505 hartree
energy: -870.063889740279
dipole: 26.95555 -26.50951 0.44604 -16.50685 16.23354 -0.27331 -2.98854 3.23349 0.24495
magnitude: 0.57762 au
magnitude: 1.46820 debye
