program: Orca
programVersion: 5.0.2
elementType: N C C C C C C C C C C C C C C C C C C C C C H H H H H H H H H H H H H H H H H H H H H H H H H
charge: 0
multiplicity: 1
keywords: wb97x-d3
keywords: def2-TZVPP
keywords: def2/J RIJCOSX
keywords: DEFGRID2
keywords: scfconv7
keywords: smallprint printgap noloewdin
keywords: NOSOSCF
formula: C21H25N
InChI: InChI=1/C21H25N/c1-21(2,3)15-8-5-9-16-22(4)17-19-13-10-12-18-11-6-7-14-20(18)19/h5-7,9-14H,16-17H2,1-4H3
47 atoms
N  -1.430804 -0.527191 -0.569582
C  -0.627752 0.60876 -0.147408
C  -1.383033 1.566099 0.735137
C  -2.479272 2.331823 0.239088
C  -3.15224 3.226239 1.115878
C  5.152205 -3.469509 -0.242025
C  -0.757231 -1.313638 -1.594398
C  -1.007083 1.7127 2.045868
C  -2.923091 2.250103 -1.103673
C  -1.904133 -1.326489 0.541313
C  -2.727554 3.338716 2.460896
C  -1.675003 2.597595 2.915216
C  -4.235366 3.994766 0.628492
C  6.358381 -2.567819 -0.525075
C  5.324585 -4.809433 -0.967134
C  5.027736 -3.710878 1.266653
C  0.498864 -1.999882 -1.142265
C  -3.971977 3.009881 -1.547074
C  -4.639736 3.890029 -0.673216
C  3.931555 -2.817684 -0.726252
C  1.721112 -1.669898 -1.570451
C  2.912478 -2.299304 -1.114416
H  -0.286392 1.129863 -1.047675
H  0.281912 0.298845 0.389147
H  -1.465952 -2.064489 -1.957056
H  -0.532618 -0.656858 -2.439563
H  -0.173944 1.132576 2.425323
H  -2.432818 1.57229 -1.78832
H  -2.433232 -2.201767 0.161506
H  -2.61335 -0.759512 1.14567
H  -1.110808 -1.680491 1.215188
H  -3.248693 4.021532 3.121461
H  -1.348455 2.682626 3.943725
H  -4.739974 4.672852 1.306692
H  6.472316 -2.377251 -1.593048
H  7.273499 -3.04568 -0.169702
H  6.263676 -1.606135 -0.018876
H  6.227466 -5.31213 -0.614504
H  4.477751 -5.471823 -0.783103
H  5.416485 -4.669893 -2.045021
H  4.175771 -4.35159 1.49799
H  5.928338 -4.200606 1.642459
H  4.903017 -2.773975 1.811341
H  0.396672 -2.794164 -0.408684
H  -4.295327 2.932089 -2.577317
H  -5.470062 4.482052 -1.036253
H  1.838676 -0.875892 -2.303818
elementType: N C H
totalener: -870.04392681 hartree
nucrepener: 1601.51530976 hartree
electener: -2471.55923658 hartree
oneelecener: -4355.54906173 hartree
twoeener: 1883.98982515 hartree
cpcmener: -0.01883779 hartree
kineticenergy: 865.85260164 hartree
xcener: -88.991567885689 hartree
chargesum: -0.0000000
charge: -0.214210 -0.014783 0.021642 -0.071886 -0.037617 0.065534 -0.049756 -0.110613 -0.249776 -0.224225 -0.136220 -0.156708 -0.099959 -0.289390 -0.289698 -0.289353 -0.134968 -0.155522 -0.154268 -0.307589 -0.227930 0.245393 0.113835 0.099150 0.102684 0.094966 0.131371 0.144940 0.110052 0.105116 0.085272 0.140710 0.154016 0.139761 0.100168 0.096305 0.100057 0.096646 0.100385 0.100625 0.100125 0.096308 0.100227 0.127449 0.154116 0.156144 0.131475
qa: -0.2142 -0.0148 0.0216 -0.0719 -0.0376 0.0655 -0.0498 -0.1106 -0.2498 -0.2242 -0.1362 -0.1567 -0.1000 -0.2894 -0.2897 -0.2894 -0.1350 -0.1555 -0.1543 -0.3076 -0.2279 0.2454 0.1138 0.0992 0.1027 0.0950 0.1314 0.1449 0.1101 0.1051 0.0853 0.1407 0.1540 0.1398 0.1002 0.0963 0.1001 0.0966 0.1004 0.1006 0.1001 0.0963 0.1002 0.1274 0.1541 0.1561 0.1315
va: 2.8014 3.7146 3.5355 3.8483 3.8600 4.0315 3.9668 3.8728 3.9980 3.9673 3.9192 3.9314 3.8744 3.8937 3.8943 3.8928 3.7573 3.9377 3.9074 4.0846 3.9736 3.6345 0.9949 1.0064 0.9993 1.0050 1.0111 1.0228 0.9949 0.9883 0.9924 1.0055 0.9928 1.0060 1.0061 1.0032 1.0059 1.0031 1.0058 1.0062 1.0063 1.0032 1.0063 1.0099 0.9938 0.9905 1.0051
dispcorr: -0.019792448 hartree
energy: -870.063719263269
dipole: 22.28721 -21.88799 0.39922 -20.65049 20.25487 -0.39562 -0.04128 0.27400 0.23272
magnitude: 0.60831 au
magnitude: 1.54621 debye
