program: Orca
programVersion: 5.0.2
elementType: N C C C C C C C C C C C C C C C C C C C C C H H H H H H H H H H H H H H H H H H H H H H H H H
charge: 0
multiplicity: 1
keywords: wb97x-d3
keywords: def2-TZVPP
keywords: def2/J RIJCOSX
keywords: DEFGRID2
keywords: scfconv7
keywords: smallprint printgap noloewdin
keywords: NOSOSCF
formula: C21H25N
InChI: InChI=1/C21H25N/c1-21(2,3)15-8-5-9-16-22(4)17-19-13-10-12-18-11-6-7-14-20(18)19/h5-7,9-14H,16-17H2,1-4H3
47 atoms
N  -1.570108 -0.406502 -1.119927
C  -1.094849 0.947395 -1.35428
C  -1.268006 1.858284 -0.16893
C  -2.563552 2.197265 0.323529
C  -2.674399 3.067689 1.44156
C  5.070871 -3.273905 -0.510928
C  -0.967029 -1.075204 0.022413
C  -0.162945 2.391222 0.44364
C  -3.755851 1.713538 -0.269556
C  -1.501837 -1.194978 -2.329477
C  -1.502814 3.586511 2.041847
C  -0.273006 3.258141 1.549367
C  -3.956465 3.40967 1.932803
C  5.600407 -3.776193 0.83722
C  5.795456 -1.981904 -0.903551
C  5.296788 -4.344321 -1.584511
C  0.511739 -1.309264 -0.069908
C  -4.982441 2.069646 0.222314
C  -5.087118 2.921123 1.339976
C  3.633035 -3.006839 -0.394967
C  1.053982 -2.521813 -0.219128
C  2.452522 -2.768301 -0.3064
H  -1.659405 1.344956 -2.204121
H  -0.038399 0.973843 -1.662771
H  -1.18124 -0.485896 0.918767
H  -1.477997 -2.032922 0.154518
H  0.823003 2.141928 0.068607
H  -3.698087 1.04606 -1.11791
H  -0.487785 -1.313037 -2.738303
H  -2.115076 -0.732809 -3.105802
H  -1.901768 -2.194223 -2.147789
H  -1.597156 4.250387 2.892973
H  0.623749 3.658342 2.004572
H  -4.028264 4.070389 2.788937
H  5.098448 -4.694716 1.144585
H  5.457569 -3.033799 1.6237
H  6.669647 -3.985954 0.763814
H  5.656823 -1.203087 -0.152341
H  6.86714 -2.168513 -0.998829
H  5.435576 -1.597511 -1.858913
H  4.791774 -5.276993 -1.32864
H  4.927962 -4.017519 -2.557679
H  6.363407 -4.556306 -1.683169
H  1.164924 -0.443581 -0.017323
H  -5.880903 1.690346 -0.248127
H  -6.063341 3.18826 1.723632
H  0.404954 -3.392062 -0.27398
elementType: N C H
totalener: -870.04367097 hartree
nucrepener: 1615.89830896 hartree
electener: -2485.94197994 hartree
oneelecener: -4384.25578332 hartree
twoeener: 1898.31380339 hartree
cpcmener: -0.01835114 hartree
kineticenergy: 865.85253305 hartree
xcener: -88.992352817232 hartree
chargesum: -0.0000000
charge: -0.208181 -0.083128 0.114274 -0.090083 -0.043045 0.064285 -0.071845 -0.131261 -0.240714 -0.208727 -0.143971 -0.156785 -0.092405 -0.289593 -0.289298 -0.290143 -0.124516 -0.154459 -0.156164 -0.307936 -0.232787 0.247717 0.117402 0.107936 0.105759 0.107336 0.136308 0.141269 0.083269 0.103163 0.102482 0.141129 0.153512 0.140243 0.100978 0.100869 0.096182 0.099998 0.095524 0.100291 0.100616 0.100523 0.096281 0.119543 0.153875 0.155550 0.128725
qa: -0.2082 -0.0831 0.1143 -0.0901 -0.0430 0.0643 -0.0718 -0.1313 -0.2407 -0.2087 -0.1440 -0.1568 -0.0924 -0.2896 -0.2893 -0.2901 -0.1245 -0.1545 -0.1562 -0.3079 -0.2328 0.2477 0.1174 0.1079 0.1058 0.1073 0.1363 0.1413 0.0833 0.1032 0.1025 0.1411 0.1535 0.1402 0.1010 0.1009 0.0962 0.1000 0.0955 0.1003 0.1006 0.1005 0.0963 0.1195 0.1539 0.1555 0.1287
va: 2.7984 3.7564 3.4456 3.8371 3.8776 4.0296 3.9954 3.8844 3.9736 3.9493 3.9312 3.9364 3.8696 3.8949 3.8949 3.8950 3.7567 3.9354 3.9118 4.0971 4.0014 3.6417 0.9941 0.9988 0.9955 1.0006 1.0057 1.0307 0.9944 0.9969 0.9959 1.0053 0.9928 1.0055 1.0057 1.0057 1.0033 1.0062 1.0038 1.0057 1.0058 1.0058 1.0033 1.0176 0.9936 0.9907 1.0073
dispcorr: -0.020192748 hartree
energy: -870.063863722188
dipole: 22.82691 -22.31640 0.51051 -17.72157 17.67306 -0.04851 -7.58495 7.38133 -0.20362
magnitude: 0.55176 au
magnitude: 1.40247 debye
