program: Orca
programVersion: 5.0.2
elementType: N C C C C C C C C C C C C C C C C C C C C C H H H H H H H H H H H H H H H H H H H H H H H H H
charge: 0
multiplicity: 1
keywords: wb97x-d3
keywords: def2-TZVPP
keywords: def2/J RIJCOSX
keywords: DEFGRID2
keywords: scfconv7
keywords: smallprint printgap noloewdin
keywords: NOSOSCF
formula: C21H25N
InChI: InChI=1/C21H25N/c1-21(2,3)15-8-5-9-16-22(4)17-19-13-10-12-18-11-6-7-14-20(18)19/h5-7,9-14H,16-17H2,1-4H3
47 atoms
N  -1.964967 -1.103272 0.959892
C  -1.967115 -0.521309 -0.373292
C  -2.486095 0.890639 -0.412161
C  -1.791943 1.952457 0.240341
C  -2.312125 3.273126 0.161306
C  4.865904 -2.336538 -0.967871
C  -1.265648 -2.378266 0.971283
C  -3.633935 1.174057 -1.107226
C  -0.587339 1.749612 0.957231
C  -3.304357 -1.238078 1.490209
C  -3.501195 3.513057 -0.567073
C  -4.145947 2.48436 -1.191152
C  -1.626944 4.330172 0.805552
C  5.581444 -1.996878 0.344366
C  5.025448 -1.17736 -1.959025
C  5.458957 -3.615531 -1.568754
C  0.197923 -2.210796 0.727396
C  0.056695 2.793354 1.564498
C  -0.469418 4.098073 1.495102
C  3.439164 -2.539791 -0.698574
C  0.868171 -2.84342 -0.24006
C  2.261657 -2.682143 -0.472555
H  -2.558553 -1.132719 -1.074812
H  -0.942086 -0.53348 -0.75448
H  -1.400302 -2.819074 1.964333
H  -1.688507 -3.097766 0.250272
H  -4.163336 0.370283 -1.605557
H  -0.170675 0.755405 1.030976
H  -3.263499 -1.653942 2.497446
H  -3.952898 -1.889143 0.883824
H  -3.790351 -0.265068 1.561864
H  -3.888442 4.523473 -0.624256
H  -5.053909 2.667103 -1.751524
H  -2.034544 5.332151 0.74008
H  5.176422 -1.089399 0.794332
H  6.645205 -1.834679 0.159619
H  5.486837 -2.805179 1.07084
H  4.526649 -1.392069 -2.905211
H  4.608011 -0.251921 -1.559961
H  6.08347 -1.006565 -2.167919
H  5.36197 -4.459516 -0.88456
H  4.965907 -3.881348 -2.504933
H  6.521083 -3.47285 -1.777448
H  0.725544 -1.534383 1.393554
H  0.976765 2.615224 2.106467
H  0.046312 4.913599 1.985702
H  0.336646 -3.513999 -0.910553
elementType: N C H
totalener: -870.04571185 hartree
nucrepener: 1628.83228833 hartree
electener: -2498.87800018 hartree
oneelecener: -4410.26570813 hartree
twoeener: 1911.38770796 hartree
cpcmener: -0.01848033 hartree
kineticenergy: 865.85737317 hartree
xcener: -88.991607593269 hartree
chargesum: -0.0000000
charge: -0.215727 -0.043525 0.020892 -0.056718 -0.041701 0.063754 -0.066306 -0.115375 -0.228226 -0.212713 -0.135594 -0.149319 -0.105215 -0.289377 -0.288586 -0.290193 -0.107163 -0.163496 -0.150609 -0.303806 -0.236792 0.244361 0.098922 0.129135 0.101585 0.083311 0.128400 0.146651 0.102670 0.082505 0.105303 0.140665 0.153631 0.139674 0.100170 0.095634 0.100496 0.100618 0.100857 0.095983 0.100550 0.100710 0.096206 0.128907 0.152449 0.155124 0.131278
qa: -0.2157 -0.0435 0.0209 -0.0567 -0.0417 0.0638 -0.0663 -0.1154 -0.2282 -0.2127 -0.1356 -0.1493 -0.1052 -0.2894 -0.2886 -0.2902 -0.1072 -0.1635 -0.1506 -0.3038 -0.2368 0.2444 0.0989 0.1291 0.1016 0.0833 0.1284 0.1467 0.1027 0.0825 0.1053 0.1407 0.1536 0.1397 0.1002 0.0956 0.1005 0.1006 0.1009 0.0960 0.1006 0.1007 0.0962 0.1289 0.1524 0.1551 0.1313
va: 2.8180 3.6921 3.5037 3.8119 3.8761 4.0322 3.9549 3.8922 3.9772 3.9632 3.9207 3.9219 3.8791 3.8929 3.8951 3.8946 3.8457 3.9509 3.8996 4.0853 4.0264 3.6560 1.0169 0.9915 0.9954 1.0107 1.0132 1.0180 0.9982 1.0011 0.9907 1.0055 0.9925 1.0061 1.0060 1.0037 1.0060 1.0060 1.0058 1.0035 1.0059 1.0056 1.0033 1.0165 0.9941 0.9908 1.0071
dispcorr: -0.019903612 hartree
energy: -870.065615459442
dipole: 17.46460 -17.50615 -0.04155 -14.63700 14.35810 -0.27891 -2.08736 1.94810 -0.13926
magnitude: 0.31450 au
magnitude: 0.79939 debye
