program: Orca
programVersion: 5.0.2
elementType: N C C C C C C C C C C C C C C C C C C C C C H H H H H H H H H H H H H H H H H H H H H H H H H
charge: 0
multiplicity: 1
keywords: wb97x-d3
keywords: def2-TZVPP
keywords: def2/J RIJCOSX
keywords: DEFGRID2
keywords: scfconv7
keywords: smallprint printgap noloewdin
keywords: NOSOSCF
formula: C21H25N
InChI: InChI=1/C21H25N/c1-21(2,3)15-8-5-9-16-22(4)17-19-13-10-12-18-11-6-7-14-20(18)19/h5-7,9-14H,16-17H2,1-4H3
47 atoms
N  -2.164733 -0.77228 -1.091265
C  -1.469801 0.411184 -1.570958
C  -1.197148 1.429323 -0.495552
C  -2.257481 2.072188 0.208881
C  -1.942088 3.026534 1.214546
C  4.783866 -2.92324 -0.33094
C  -1.487264 -1.459008 -0.003909
C  0.098931 1.763726 -0.197172
C  -3.623346 1.813231 -0.063762
C  -2.524685 -1.644785 -2.187131
C  -0.588152 3.328333 1.492334
C  0.41152 2.714259 0.794546
C  -2.989074 3.668889 1.916249
C  5.188726 -2.483285 -1.742623
C  4.829472 -4.452373 -0.232063
C  5.738536 -2.307444 0.697313
C  -0.110665 -1.969078 -0.313603
C  -4.614474 2.457203 0.626807
C  -4.29714 3.390943 1.632724
C  3.417516 -2.465602 -0.062183
C  0.968303 -1.62808 0.397644
C  2.284421 -2.096452 0.133896
H  -2.095952 0.861933 -2.348137
H  -0.515333 0.163347 -2.061062
H  -1.439118 -0.796146 0.863956
H  -2.121834 -2.301107 0.291176
H  0.907201 1.282799 -0.734997
H  -3.886853 1.088464 -0.820838
H  -3.074689 -2.508473 -1.810208
H  -1.671508 -2.020081 -2.770795
H  -3.180848 -1.115804 -2.881223
H  -0.358529 4.05726 2.260466
H  1.448154 2.948012 1.00061
H  -2.735867 4.391547 2.68307
H  4.521206 -2.902482 -2.496756
H  6.20233 -2.823035 -1.96399
H  5.169503 -1.397086 -1.841129
H  4.551378 -4.795175 0.76545
H  4.153077 -4.917888 -0.950139
H  5.839702 -4.809876 -0.4409
H  5.476844 -2.60539 1.713449
H  6.760289 -2.639199 0.502865
H  5.724954 -1.217643 0.650753
H  0.00042 -2.65093 -1.151605
H  -5.652089 2.245046 0.402349
H  -5.09057 3.889526 2.174584
H  0.860151 -0.942645 1.234687
elementType: N C H
totalener: -870.04353058 hartree
nucrepener: 1645.59553328 hartree
electener: -2515.63906386 hartree
oneelecener: -4443.80995489 hartree
twoeener: 1928.17089104 hartree
cpcmener: -0.01771553 hartree
kineticenergy: 865.85976382 hartree
xcener: -88.995137092937 hartree
chargesum: -0.0000000
charge: -0.212849 -0.074568 0.178973 -0.125966 -0.026992 0.055914 -0.068490 -0.192248 -0.243147 -0.202846 -0.157858 -0.130206 -0.092604 -0.287812 -0.288208 -0.289013 -0.104171 -0.156443 -0.154878 -0.297476 -0.281067 0.265943 0.122266 0.106833 0.098306 0.107205 0.132085 0.142547 0.101601 0.083484 0.097945 0.140329 0.154114 0.139282 0.100439 0.096273 0.100305 0.100485 0.100030 0.096465 0.100387 0.096299 0.099795 0.128197 0.153783 0.155179 0.132376
qa: -0.2128 -0.0746 0.1790 -0.1260 -0.0270 0.0559 -0.0685 -0.1922 -0.2431 -0.2028 -0.1579 -0.1302 -0.0926 -0.2878 -0.2882 -0.2890 -0.1042 -0.1564 -0.1549 -0.2975 -0.2811 0.2659 0.1223 0.1068 0.0983 0.1072 0.1321 0.1425 0.1016 0.0835 0.0979 0.1403 0.1541 0.1393 0.1004 0.0963 0.1003 0.1005 0.1000 0.0965 0.1004 0.0963 0.0998 0.1282 0.1538 0.1552 0.1324
va: 2.8114 3.7310 3.3903 3.8598 3.8584 4.0410 3.9878 3.9148 3.9709 3.9490 3.9475 3.9083 3.8688 3.8917 3.8933 3.8927 3.7282 3.9389 3.9103 4.0804 3.9814 3.6299 0.9905 1.0023 1.0014 0.9952 1.0073 1.0321 0.9962 0.9949 0.9949 1.0055 0.9917 1.0059 1.0061 1.0035 1.0064 1.0062 1.0062 1.0032 1.0060 1.0033 1.0060 1.0114 0.9938 0.9909 1.0011
dispcorr: -0.020962298 hartree
energy: -870.064492875432
dipole: 18.79190 -18.42327 0.36864 -18.41729 18.07589 -0.34140 -7.25063 6.89590 -0.35473
magnitude: 0.61505 au
magnitude: 1.56333 debye
