program: Orca
programVersion: 5.0.2
elementType: N C C C C C C C C C C C C C C C C C C C C C H H H H H H H H H H H H H H H H H H H H H H H H H
charge: 0
multiplicity: 1
keywords: wb97x-d3
keywords: def2-TZVPP
keywords: def2/J RIJCOSX
keywords: DEFGRID2
keywords: scfconv7
keywords: smallprint printgap noloewdin
keywords: NOSOSCF
formula: C21H25N
InChI: InChI=1/C21H25N/c1-21(2,3)15-8-5-9-16-22(4)17-19-13-10-12-18-11-6-7-14-20(18)19/h5-7,9-14H,16-17H2,1-4H3
47 atoms
N  -0.803666 -0.367237 0.084966
C  -2.231821 -0.11308 0.205947
C  -2.514074 1.18791 0.918712
C  -3.085983 2.325241 0.276794
C  -3.299799 3.511207 1.037713
C  5.569428 -3.667831 -0.609066
C  -0.553399 -1.7293 -0.356269
C  -2.182394 1.270376 2.249221
C  -3.450283 2.348079 -1.094124
C  -0.157497 0.594659 -0.783245
C  -2.94512 3.54123 2.404058
C  -2.39613 2.440135 2.998127
C  -3.8610 4.651036 0.413834
C  6.430456 -2.771348 -1.506649
C  5.78626 -5.137735 -0.985347
C  5.946927 -3.446638 0.859996
C  0.878472 -2.108541 -0.172231
C  -3.989214 3.466165 -1.668716
C  -4.200058 4.633692 -0.909088
C  4.157996 -3.319598 -0.798514
C  1.640615 -2.638134 -1.132826
C  2.999321 -3.012487 -0.942831
H  -2.663464 -0.923249 0.799431
H  -2.736361 -0.15781 -0.768693
H  -1.165446 -2.397646 0.259097
H  -0.859058 -1.899179 -1.402263
H  -1.746125 0.407716 2.7387
H  -3.305345 1.470188 -1.70768
H  0.918216 0.417837 -0.81198
H  -0.303416 1.608037 -0.408742
H  -0.527403 0.560436 -1.819945
H  -3.11425 4.44883 2.971191
H  -2.124975 2.461036 4.045832
H  -4.015836 5.543903 1.008077
H  6.294742 -1.71688 -1.262676
H  6.182973 -2.908608 -2.560111
H  7.486802 -3.013911 -1.374977
H  6.836102 -5.406839 -0.85254
H  5.187863 -5.801323 -0.359626
H  5.520995 -5.325052 -2.026692
H  5.803048 -2.406348 1.155128
H  5.347688 -4.071678 1.523473
H  6.997259 -3.698791 1.018465
H  1.2956 -1.94767 0.817372
H  -4.257939 3.453967 -2.717228
H  -4.627678 5.511589 -1.37605
H  1.226355 -2.791178 -2.125975
elementType: N C H
totalener: -870.04371009 hartree
nucrepener: 1570.66337499 hartree
electener: -2440.70708508 hartree
oneelecener: -4293.76626349 hartree
twoeener: 1853.05917841 hartree
cpcmener: -0.01916788 hartree
kineticenergy: 865.85540496 hartree
xcener: -88.990119161732 hartree
chargesum: -0.0000000
charge: -0.205252 -0.069654 0.105342 -0.077336 -0.005606 0.066879 -0.051622 -0.214581 -0.214588 -0.219326 -0.142186 -0.148528 -0.098416 -0.289980 -0.289520 -0.290962 -0.125527 -0.158294 -0.152494 -0.310550 -0.222426 0.238362 0.111823 0.106256 0.098812 0.090320 0.128459 0.144762 0.112373 0.108792 0.084133 0.140328 0.154669 0.140366 0.101036 0.100549 0.095982 0.096217 0.100163 0.100431 0.100518 0.099899 0.095673 0.123478 0.154832 0.155569 0.130827
qa: -0.2053 -0.0697 0.1053 -0.0773 -0.0056 0.0669 -0.0516 -0.2146 -0.2146 -0.2193 -0.1422 -0.1485 -0.0984 -0.2900 -0.2895 -0.2910 -0.1255 -0.1583 -0.1525 -0.3105 -0.2224 0.2384 0.1118 0.1063 0.0988 0.0903 0.1285 0.1448 0.1124 0.1088 0.0841 0.1403 0.1547 0.1404 0.1010 0.1005 0.0960 0.0962 0.1002 0.1004 0.1005 0.0999 0.0957 0.1235 0.1548 0.1556 0.1308
va: 2.8369 3.8296 3.4373 3.7812 3.8421 4.0280 3.9269 3.9921 3.9327 3.9505 3.9252 3.9141 3.8742 3.8960 3.8962 3.8954 3.8765 3.9342 3.9093 4.1007 4.0318 3.6606 0.9982 1.0057 0.9995 1.0111 1.0189 1.0086 0.9976 0.9916 1.0035 1.0059 0.9918 1.0062 1.0055 1.0059 1.0034 1.0032 1.0060 1.0058 1.0057 1.0060 1.0035 1.0230 0.9929 0.9907 1.0077
dispcorr: -0.019086196 hartree
energy: -870.062796285323
dipole: 26.00804 -26.03498 -0.02694 -17.47183 17.36560 -0.10623 -4.97689 4.73089 -0.24600
magnitude: 0.26931 au
magnitude: 0.68452 debye
