program: Orca
programVersion: 5.0.2
elementType: N C C C C C C C C C C C C C C C C C C C C C H H H H H H H H H H H H H H H H H H H H H H H H H
charge: 0
multiplicity: 1
keywords: wb97x-d3
keywords: def2-TZVPP
keywords: def2/J RIJCOSX
keywords: DEFGRID2
keywords: scfconv7
keywords: smallprint printgap noloewdin
keywords: NOSOSCF
formula: C21H25N
InChI: InChI=1/C21H25N/c1-21(2,3)15-8-5-9-16-22(4)17-19-13-10-12-18-11-6-7-14-20(18)19/h5-7,9-14H,16-17H2,1-4H3
47 atoms
N  -1.807293 -1.113935 -0.1052
C  -1.20005 0.153767 -0.479001
C  -1.544487 1.251984 0.498452
C  -2.241057 2.440158 0.131223
C  -2.502216 3.423016 1.130357
C  5.13775 -3.116425 -0.319626
C  -1.214629 -2.225963 -0.828271
C  -1.152802 1.08661 1.805196
C  -2.696604 2.703328 -1.18681
C  -3.243323 -1.083416 -0.280035
C  -2.077549 3.20373 2.458971
C  -1.414131 2.055241 2.788709
C  -3.187577 4.611343 0.780645
C  5.999303 -3.00214 -1.581567
C  5.333841 -4.496799 0.317585
C  5.533419 -2.022889 0.679805
C  0.21244 -2.438953 -0.445005
C  -3.355346 3.862454 -1.493394
C  -3.603586 4.831862 -0.501546
C  3.728194 -2.942678 -0.682518
C  1.206992 -2.568745 -1.327262
C  2.565598 -2.784584 -0.967074
H  -1.452989 0.428103 -1.5121
H  -0.114326 0.029005 -0.469499
H  -1.780147 -3.125864 -0.563751
H  -1.299578 -2.117409 -1.922299
H  -0.622857 0.184346 2.086339
H  -2.525202 1.982364 -1.97376
H  -3.681437 -2.02413 0.056171
H  -3.554084 -0.92341 -1.323829
H  -3.685219 -0.287933 0.321136
H  -2.282043 3.959378 3.208022
H  -1.08467 1.886031 3.805982
H  -3.3745 5.34879 1.552483
H  5.740895 -3.770846 -2.311298
H  7.054314 -3.121658 -1.32671
H  5.877895 -2.029111 -2.05998
H  4.728577 -4.609635 1.218087
H  5.062898 -5.296413 -0.373358
H  6.380508 -4.634428 0.596755
H  5.406813 -1.027713 0.250969
H  4.931758 -2.077533 1.588251
H  6.581764 -2.135218 0.963784
H  0.423375 -2.503779 0.618468
H  -3.689005 4.037144 -2.508381
H  -4.123463 5.745891 -0.758553
H  0.992917 -2.493081 -2.390361
elementType: N C H
totalener: -870.04342355 hartree
nucrepener: 1595.88276663 hartree
electener: -2465.92619018 hartree
oneelecener: -4344.24031880 hartree
twoeener: 1878.31412863 hartree
cpcmener: -0.01870632 hartree
kineticenergy: 865.85095958 hartree
xcener: -88.989829479181 hartree
chargesum: -0.0000000
charge: -0.209451 -0.087304 0.122011 -0.074973 -0.009381 0.062039 -0.068806 -0.208093 -0.231234 -0.211788 -0.137056 -0.159310 -0.095733 -0.289720 -0.289095 -0.288046 -0.096975 -0.152232 -0.155682 -0.311444 -0.242110 0.250451 0.111162 0.125907 0.102940 0.084475 0.134506 0.142264 0.104849 0.082676 0.105817 0.140085 0.153854 0.138852 0.099839 0.096046 0.099929 0.100541 0.100687 0.096277 0.100566 0.100240 0.096161 0.124045 0.154813 0.156382 0.131021
qa: -0.2095 -0.0873 0.1220 -0.0750 -0.0094 0.0620 -0.0688 -0.2081 -0.2312 -0.2118 -0.1371 -0.1593 -0.0957 -0.2897 -0.2891 -0.2880 -0.0970 -0.1522 -0.1557 -0.3114 -0.2421 0.2505 0.1112 0.1259 0.1029 0.0845 0.1345 0.1423 0.1048 0.0827 0.1058 0.1401 0.1539 0.1389 0.0998 0.0960 0.0999 0.1005 0.1007 0.0963 0.1006 0.1002 0.0962 0.1240 0.1548 0.1564 0.1310
va: 2.8493 3.8065 3.3576 3.8019 3.8430 4.0355 3.9601 3.9760 3.9505 3.9550 3.9195 3.9318 3.8738 3.8944 3.8922 3.8927 3.8448 3.9232 3.9083 4.0896 4.0360 3.6477 1.0114 0.9972 0.9938 1.0101 1.0182 1.0161 0.9977 1.0006 0.9912 1.0060 0.9928 1.0068 1.0062 1.0033 1.0060 1.0060 1.0060 1.0034 1.0062 1.0062 1.0033 1.0218 0.9929 0.9907 1.0072
dispcorr: -0.019275184 hartree
energy: -870.062698733829
dipole: 18.81851 -18.77831 0.04019 -17.51479 17.43318 -0.08161 -3.13029 2.83118 -0.29911
magnitude: 0.31264 au
magnitude: 0.79466 debye
