program: Orca
programVersion: 5.0.2
elementType: N C C C C C C C C C C C C C C C C C C C C C H H H H H H H H H H H H H H H H H H H H H H H H H
charge: 0
multiplicity: 1
keywords: wb97x-d3
keywords: def2-TZVPP
keywords: def2/J RIJCOSX
keywords: DEFGRID2
keywords: scfconv7
keywords: smallprint printgap noloewdin
keywords: NOSOSCF
formula: C21H25N
InChI: InChI=1/C21H25N/c1-21(2,3)15-8-5-9-16-22(4)17-19-13-10-12-18-11-6-7-14-20(18)19/h5-7,9-14H,16-17H2,1-4H3
47 atoms
N  -1.61486 -1.18431 0.521359
C  -1.450541 0.14725 -0.024865
C  -2.421403 1.158783 0.540306
C  -2.194016 2.553737 0.339478
C  -3.123064 3.493703 0.864984
C  5.151913 -3.08053 -1.19582
C  -1.178712 -2.23665 -0.385686
C  -3.54585 0.761196 1.216337
C  -1.078098 3.053195 -0.377524
C  -1.023388 -1.306332 1.837433
C  -4.261142 3.033345 1.566804
C  -4.46728 1.694457 1.731675
C  -2.898707 4.877062 0.673495
C  5.542237 -4.358827 -1.945931
C  5.941115 -2.990013 0.115206
C  5.450407 -1.855554 -2.067246
C  0.281585 -2.216703 -0.73033
C  -0.889506 4.39804 -0.550042
C  -1.806718 5.323799 -0.017222
C  3.718124 -3.114648 -0.891574
C  1.147961 -3.154477 -0.335745
C  2.53651 -3.128675 -0.643109
H  -1.602699 0.101239 -1.108519
H  -0.422315 0.510869 0.116426
H  -1.435573 -3.19987 0.063343
H  -1.765253 -2.151021 -1.305614
H  -3.729081 -0.295315 1.361248
H  -0.357025 2.369443 -0.804656
H  -1.201786 -2.306619 2.235478
H  -1.482705 -0.596669 2.526404
H  0.060862 -1.125929 1.855413
H  -4.963604 3.756068 1.964462
H  -5.340665 1.338063 2.263051
H  -3.612593 5.58155 1.083914
H  6.608642 -4.342997 -2.179619
H  4.993981 -4.453186 -2.884158
H  5.343106 -5.248572 -1.347112
H  5.743155 -3.848176 0.758814
H  7.012441 -2.966584 -0.094298
H  5.688209 -2.08582 0.670766
H  5.180585 -0.929346 -1.557897
H  6.516145 -1.812508 -2.300309
H  4.902121 -1.894599 -3.009516
H  0.64434 -1.378339 -1.31829
H  -0.02814 4.753324 -1.101167
H  -1.645762 6.384845 -0.158287
H  0.795104 -3.995643 0.255871
elementType: N C H
totalener: -870.04319839 hartree
nucrepener: 1585.67200365 hartree
electener: -2455.71520204 hartree
oneelecener: -4323.66686671 hartree
twoeener: 1867.95166467 hartree
cpcmener: -0.01873004 hartree
kineticenergy: 865.85100405 hartree
xcener: -88.993569742880 hartree
chargesum: -0.0000000
charge: -0.191212 -0.042227 0.154575 -0.144677 0.004225 0.065935 -0.058510 -0.241031 -0.224406 -0.203517 -0.164140 -0.131283 -0.108765 -0.290159 -0.289431 -0.290840 -0.131822 -0.169633 -0.144747 -0.312821 -0.226889 0.248074 0.115564 0.097134 0.101934 0.096232 0.138256 0.146464 0.104850 0.110141 0.086931 0.140129 0.154685 0.139562 0.096252 0.100888 0.100353 0.100562 0.096034 0.101066 0.100486 0.095599 0.100239 0.127643 0.154950 0.155982 0.131363
qa: -0.1912 -0.0422 0.1546 -0.1447 0.0042 0.0659 -0.0585 -0.2410 -0.2244 -0.2035 -0.1641 -0.1313 -0.1088 -0.2902 -0.2894 -0.2908 -0.1318 -0.1696 -0.1447 -0.3128 -0.2269 0.2481 0.1156 0.0971 0.1019 0.0962 0.1383 0.1465 0.1049 0.1101 0.0869 0.1401 0.1547 0.1396 0.0963 0.1009 0.1004 0.1006 0.0960 0.1011 0.1005 0.0956 0.1002 0.1276 0.1549 0.1560 0.1314
va: 2.8746 3.8589 3.4415 3.9766 3.8086 4.0283 3.9653 3.9478 3.9728 3.9214 3.9441 3.9254 3.8834 3.8958 3.8962 3.8956 3.7488 3.9426 3.9016 4.0946 3.9756 3.6243 0.9893 0.9891 0.9992 1.0025 1.0405 1.0068 0.9975 0.9940 1.0001 1.0064 0.9926 1.0069 1.0032 1.0058 1.0060 1.0059 1.0033 1.0055 1.0059 1.0037 1.0058 1.0118 0.9940 0.9906 1.0063
dispcorr: -0.018997722 hartree
energy: -870.062196112265
dipole: 24.56012 -23.93750 0.62262 -16.90807 16.87413 -0.03394 -3.75521 3.55277 -0.20245
magnitude: 0.65559 au
magnitude: 1.66637 debye
