program: Orca
programVersion: 5.0.2
elementType: N C C C C C C C C C C C C C C C C C C C C C H H H H H H H H H H H H H H H H H H H H H H H H H
charge: 0
multiplicity: 1
keywords: wb97x-d3
keywords: def2-TZVPP
keywords: def2/J RIJCOSX
keywords: DEFGRID2
keywords: scfconv7
keywords: smallprint printgap noloewdin
keywords: NOSOSCF
formula: C21H25N
InChI: InChI=1/C21H25N/c1-21(2,3)15-8-5-9-16-22(4)17-19-13-10-12-18-11-6-7-14-20(18)19/h5-7,9-14H,16-17H2,1-4H3
47 atoms
N  -1.047855 -0.338483 -1.230624
C  -2.252667 0.3846 -0.875717
C  -1.987284 1.706694 -0.194196
C  -3.008262 2.337395 0.578824
C  -2.7333 3.581872 1.210887
C  5.335299 -3.724404 -0.634216
C  -0.425895 -0.92939 -0.056485
C  -0.777685 2.337927 -0.336777
C  -4.302164 1.782185 0.743386
C  -1.317312 -1.340002 -2.240983
C  -1.464736 4.183946 1.046511
C  -0.512048 3.575127 0.2817
C  -3.735104 4.202764 1.99334
C  5.513591 -4.035522 -2.124945
C  5.636613 -4.977195 0.195532
C  6.281459 -2.589062 -0.227113
C  0.977394 -1.360006 -0.322687
C  -5.253392 2.409704 1.501577
C  -4.967966 3.630899 2.141223
C  3.95013 -3.307965 -0.394953
C  1.457687 -2.566057 -0.007296
C  2.808806 -2.957329 -0.214767
H  -2.911605 -0.237674 -0.251251
H  -2.816147 0.579434 -1.793835
H  -0.400281 -0.172955 0.734502
H  -1.014819 -1.773072 0.340657
H  -0.003261 1.870101 -0.93026
H  -4.557801 0.848389 0.261523
H  -1.71827 -0.868621 -3.139311
H  -2.034858 -2.108385 -1.913985
H  -0.396099 -1.850696 -2.524208
H  -1.264175 5.13185 1.531555
H  0.458158 4.036468 0.148126
H  -3.507038 5.145858 2.476101
H  4.849757 -4.839221 -2.446143
H  6.540847 -4.349295 -2.320994
H  5.30627 -3.159718 -2.74128
H  6.665374 -5.300432 0.024751
H  5.517271 -4.786197 1.262834
H  4.97664 -5.802139 -0.076005
H  6.084846 -1.68296 -0.801799
H  6.180245 -2.345775 0.831366
H  7.317446 -2.882879 -0.406973
H  1.634017 -0.62002 -0.770642
H  -6.233425 1.963279 1.610992
H  -5.726069 4.114004 2.744033
H  0.798036 -3.308079 0.434865
elementType: N C H
totalener: -870.04457940 hartree
nucrepener: 1576.27991954 hartree
electener: -2446.32449893 hartree
oneelecener: -4304.93217782 hartree
twoeener: 1858.60767889 hartree
cpcmener: -0.01821857 hartree
kineticenergy: 865.85389930 hartree
xcener: -88.992288097929 hartree
chargesum: -0.0000000
charge: -0.207560 -0.056682 0.142592 -0.123546 0.001030 0.060634 -0.068373 -0.236268 -0.214155 -0.200819 -0.166775 -0.125762 -0.103253 -0.287548 -0.289547 -0.287408 -0.118579 -0.167061 -0.147448 -0.316778 -0.221419 0.245009 0.096661 0.113731 0.124015 0.099793 0.136900 0.143840 0.099625 0.078778 0.104197 0.140136 0.154207 0.140256 0.100445 0.096063 0.100108 0.096066 0.100322 0.100056 0.099723 0.100522 0.095913 0.126445 0.154268 0.156357 0.131291
qa: -0.2076 -0.0567 0.1426 -0.1235 0.0010 0.0606 -0.0684 -0.2363 -0.2142 -0.2008 -0.1668 -0.1258 -0.1033 -0.2875 -0.2895 -0.2874 -0.1186 -0.1671 -0.1474 -0.3168 -0.2214 0.2450 0.0967 0.1137 0.1240 0.0998 0.1369 0.1438 0.0996 0.0788 0.1042 0.1401 0.1542 0.1403 0.1004 0.0961 0.1001 0.0961 0.1003 0.1001 0.0997 0.1005 0.0959 0.1264 0.1543 0.1564 0.1313
va: 2.8452 3.8638 3.4221 3.9429 3.8121 4.0379 3.8631 3.9609 3.9622 3.9518 3.9463 3.9164 3.8778 3.8937 3.8940 3.8920 3.8867 3.9364 3.9026 4.0984 4.0333 3.6621 1.0013 0.9898 0.9885 1.0175 1.0427 1.0105 0.9968 1.0009 0.9921 1.0063 0.9922 1.0063 1.0063 1.0034 1.0060 1.0036 1.0061 1.0060 1.0063 1.0062 1.0035 1.0191 0.9940 0.9904 1.0074
dispcorr: -0.018752484 hartree
energy: -870.063331879044
dipole: 22.27715 -22.46303 -0.18588 -21.08513 20.75189 -0.33324 -7.22604 7.18149 -0.04454
magnitude: 0.38417 au
magnitude: 0.97647 debye
