program: Orca
programVersion: 5.0.2
elementType: N C C C C C C C C C C C C C C C C C C C C C H H H H H H H H H H H H H H H H H H H H H H H H H
charge: 0
multiplicity: 1
keywords: wb97x-d3
keywords: def2-TZVPP
keywords: def2/J RIJCOSX
keywords: DEFGRID2
keywords: scfconv7
keywords: smallprint printgap noloewdin
keywords: NOSOSCF
formula: C21H25N
InChI: InChI=1/C21H25N/c1-21(2,3)15-8-5-9-16-22(4)17-19-13-10-12-18-11-6-7-14-20(18)19/h5-7,9-14H,16-17H2,1-4H3
47 atoms
N  -1.245485 -0.618322 0.342475
C  -2.669596 -0.356793 0.272101
C  -3.061066 0.983858 0.835046
C  -2.588009 2.196915 0.255305
C  -3.025039 3.436016 0.794721
C  5.391872 -3.079263 -1.069314
C  -0.877415 -1.813795 -0.388868
C  -3.91529 1.043451 1.904315
C  -1.707967 2.222658 -0.852639
C  -0.751353 -0.63331 1.700913
C  -3.905426 3.443468 1.90055
C  -4.342221 2.271709 2.44435
C  -2.578385 4.643235 0.211528
C  6.125401 -2.761432 0.240308
C  5.765987 -2.043651 -2.136925
C  5.780227 -4.482033 -1.55088
C  0.592705 -1.867624 -0.646457
C  -1.30007 3.407642 -1.400093
C  -1.738614 4.633207 -0.86539
C  3.948463 -3.027465 -0.828825
C  1.369091 -2.912263 -0.352548
C  2.763101 -2.967762 -0.618242
H  -3.256988 -1.136052 0.788243
H  -2.96709 -0.402278 -0.781145
H  -1.209851 -2.740506 0.111722
H  -1.394704 -1.784912 -1.354747
H  -4.274564 0.121339 2.3456
H  -1.333621 1.29148 -1.251368
H  -1.213576 -1.422145 2.316917
H  -0.942216 0.324135 2.18355
H  0.325699 -0.796748 1.704962
H  -4.22966 4.394026 2.306547
H  -5.016625 2.27794 3.290374
H  -2.917401 5.582283 0.632196
H  7.205604 -2.795139 0.085595
H  5.871725 -3.481454 1.018236
H  5.865058 -1.767793 0.605011
H  6.841391 -2.065934 -2.323515
H  5.254832 -2.246204 -3.078113
H  5.49856 -1.035802 -1.819481
H  6.857001 -4.53536 -1.722977
H  5.517608 -5.239443 -0.812422
H  5.275801 -4.73278 -2.483949
H  1.027395 -0.988902 -1.111231
H  -0.629296 3.404503 -2.249316
H  -1.405877 5.563776 -1.305859
H  0.931554 -3.784136 0.126011
totalener: -870.02517654 hartree
nucrepener: 1591.54671482 hartree
electener: -2461.57189136 hartree
oneelecener: -4334.83545021 hartree
twoeener: 1873.26355884 hartree
kineticenergy: 865.89162739 hartree
xcener: -88.996184097632 hartree
chargesum: -0.0000000
charge: -0.188149 -0.087898 0.053989 -0.089371 -0.026183 -0.001654 -0.050284 -0.079492 -0.167174 -0.193419 -0.103928 -0.123428 -0.067643 -0.260286 -0.261394 -0.260893 -0.120424 -0.127001 -0.118607 -0.251785 -0.185207 0.254619 0.083693 0.109878 0.077803 0.087486 0.099066 0.111048 0.070173 0.105985 0.106083 0.106627 0.121573 0.105440 0.083565 0.093972 0.095679 0.084185 0.094356 0.093638 0.084097 0.093508 0.094964 0.113952 0.120094 0.121928 0.096821
qa: -0.1881 -0.0879 0.0540 -0.0894 -0.0262 -0.0017 -0.0503 -0.0795 -0.1672 -0.1934 -0.1039 -0.1234 -0.0676 -0.2603 -0.2614 -0.2609 -0.1204 -0.1270 -0.1186 -0.2518 -0.1852 0.2546 0.0837 0.1099 0.0778 0.0875 0.0991 0.1110 0.0702 0.1060 0.1061 0.1066 0.1216 0.1054 0.0836 0.0940 0.0957 0.0842 0.0944 0.0936 0.0841 0.0935 0.0950 0.1140 0.1201 0.1219 0.0968
va: 2.7964 3.7857 3.5397 3.9560 3.9489 4.1311 3.9065 3.9335 3.9946 3.9568 3.9737 3.9915 3.9237 3.9029 3.9022 3.9032 3.9015 3.9942 3.9651 3.9791 4.0710 3.6760 1.0138 0.9951 1.0150 1.0009 1.0192 1.0437 1.0065 0.9948 0.9993 1.0141 1.0028 1.0142 1.0066 1.0097 1.0092 1.0066 1.0095 1.0099 1.0064 1.0096 1.0095 1.0229 1.0032 1.0008 1.0128
dispcorr: -0.019416416 hartree
energy: -870.044592959488
dipole: 24.10639 -24.01184 0.09455 -16.98884 16.82912 -0.15971 -2.62006 2.68193 0.06187
magnitude: 0.19564 au
magnitude: 0.49729 debye
