program: Orca
programVersion: 5.0.2
elementType: N C C C C C C C C C C C C C C C C C C C C C H H H H H H H H H H H H H H H H H H H H H H H H H
charge: 0
multiplicity: 1
keywords: wb97x-d3
keywords: def2-TZVPP
keywords: def2/J RIJCOSX
keywords: DEFGRID2
keywords: scfconv7
keywords: smallprint printgap noloewdin
keywords: NOSOSCF
formula: C21H25N
InChI: InChI=1/C21H25N/c1-21(2,3)15-8-5-9-16-22(4)17-19-13-10-12-18-11-6-7-14-20(18)19/h5-7,9-14H,16-17H2,1-4H3
47 atoms
N  -2.152598 -1.176111 -0.388869
C  -3.26687 -0.35249 0.039431
C  -2.853912 0.785266 0.934569
C  -1.962258 1.797497 0.475285
C  -1.606028 2.853365 1.35498
C  4.66256 -2.178533 -1.279438
C  -1.460802 -1.83787 0.694146
C  -3.350816 0.86025 2.20943
C  -1.424449 1.807194 -0.833552
C  -2.537441 -2.09802 -1.431944
C  -2.141665 2.882278 2.66276
C  -2.999857 1.908694 3.081178
C  -0.724575 3.862793 0.906278
C  4.982475 -1.754319 -2.717861
C  5.002043 -3.661896 -1.089246
C  5.483211 -1.330632 -0.298863
C  -0.024215 -2.136917 0.393582
C  -0.579706 2.801862 -1.24125
C  -0.219732 3.840226 -0.362271
C  3.236547 -1.96837 -1.021191
C  0.691255 -1.527634 -0.553528
C  2.066317 -1.783564 -0.797553
H  -4.048195 -0.94095 0.550118
H  -3.741164 0.050675 -0.861705
H  -1.483846 -1.192532 1.578411
H  -1.970963 -2.768477 0.999287
H  -4.029811 0.090819 2.557938
H  -1.667735 1.003459 -1.512508
H  -3.305477 -2.819989 -1.111881
H  -1.670188 -2.663014 -1.772174
H  -2.932256 -1.551397 -2.290158
H  -1.862461 3.691578 3.326451
H  -3.412765 1.933605 4.080888
H  -0.455012 4.660104 1.588295
H  6.044932 -1.895414 -2.925982
H  4.742013 -0.70357 -2.879808
H  4.414805 -2.343805 -3.437912
H  4.782482 -3.987932 -0.072519
H  4.429521 -4.287759 -1.773894
H  6.063394 -3.83392 -1.278917
H  5.257031 -0.270464 -0.412128
H  5.273076 -1.609438 0.733626
H  6.550836 -1.472048 -0.478956
H  0.453633 -2.873386 1.030758
H  -0.177867 2.787577 -2.245852
H  0.455393 4.617736 -0.694435
H  0.210092 -0.780568 -1.176279
totalener: -870.02378750 hartree
nucrepener: 1656.66611154 hartree
electener: -2526.68989904 hartree
oneelecener: -4465.29518930 hartree
twoeener: 1938.60529026 hartree
kineticenergy: 865.89159501 hartree
xcener: -88.999867290644 hartree
chargesum: -0.0000000
charge: -0.204395 -0.103595 0.129086 -0.048624 -0.041540 0.000599 -0.042940 -0.121224 -0.262264 -0.179776 -0.110151 -0.109180 -0.053600 -0.263229 -0.260622 -0.259723 -0.114980 -0.096056 -0.127348 -0.224125 -0.233265 0.262706 0.084692 0.114569 0.103926 0.075536 0.103820 0.120150 0.078178 0.106691 0.083143 0.107101 0.122135 0.105715 0.082729 0.093592 0.093161 0.092529 0.093341 0.083081 0.094957 0.093733 0.082549 0.098415 0.121307 0.122296 0.106902
qa: -0.2044 -0.1036 0.1291 -0.0486 -0.0415 0.0006 -0.0429 -0.1212 -0.2623 -0.1798 -0.1102 -0.1092 -0.0536 -0.2632 -0.2606 -0.2597 -0.1150 -0.0961 -0.1273 -0.2241 -0.2333 0.2627 0.0847 0.1146 0.1039 0.0755 0.1038 0.1201 0.0782 0.1067 0.0831 0.1071 0.1221 0.1057 0.0827 0.0936 0.0932 0.0925 0.0933 0.0831 0.0950 0.0937 0.0825 0.0984 0.1213 0.1223 0.1069
va: 2.8089 3.7923 3.4810 3.8936 3.9803 4.1316 3.9328 3.9492 3.9769 3.9377 3.9855 3.9748 3.9137 3.9033 3.9011 3.9011 3.8522 3.9743 3.9858 3.9654 3.9883 3.7397 1.0112 0.9899 0.9991 1.0059 1.0169 1.0302 1.0060 0.9963 1.0003 1.0141 1.0021 1.0139 1.0067 1.0096 1.0099 1.0102 1.0099 1.0067 1.0099 1.0100 1.0062 1.0234 1.0023 1.0008 1.0222
dispcorr: -0.020754003 hartree
energy: -870.044541507538
dipole: 16.83301 -17.00917 -0.17616 -16.06373 15.92224 -0.14149 -7.91843 8.03457 0.11615
magnitude: 0.25405 au
magnitude: 0.64575 debye
