program: Orca
programVersion: 5.0.2
elementType: N C C C C C C C C C C C C C C C C C C C C C H H H H H H H H H H H H H H H H H H H H H H H H H
charge: 0
multiplicity: 1
keywords: wb97x-d3
keywords: def2-TZVPP
keywords: def2/J RIJCOSX
keywords: DEFGRID2
keywords: scfconv7
keywords: smallprint printgap noloewdin
keywords: NOSOSCF
formula: C21H25N
InChI: InChI=1/C21H25N/c1-21(2,3)15-8-5-9-16-22(4)17-19-13-10-12-18-11-6-7-14-20(18)19/h5-7,9-14H,16-17H2,1-4H3
47 atoms
N  -1.939944 -1.103715 0.951368
C  -1.955229 -0.520053 -0.377318
C  -2.486851 0.887587 -0.412767
C  -1.811537 1.951276 0.253383
C  -2.327219 3.27032 0.148762
C  4.868586 -2.344716 -0.977054
C  -1.255868 -2.382229 0.964263
C  -3.623389 1.163083 -1.126804
C  -0.631786 1.751277 1.008521
C  -3.2594 -1.189236 1.532417
C  -3.504628 3.501493 -0.598738
C  -4.14075 2.469114 -1.222622
C  -1.649841 4.332256 0.78963
C  5.582935 -2.029676 0.342976
C  5.042587 -1.171511 -1.950443
C  5.454998 -3.620029 -1.59442
C  0.208807 -2.22916 0.715824
C  0.003461 2.800024 1.613907
C  -0.508887 4.106171 1.505857
C  3.441417 -2.542176 -0.71677
C  0.872167 -2.840371 -0.268224
C  2.264172 -2.68513 -0.501029
H  -2.547282 -1.134847 -1.078571
H  -0.932001 -0.52729 -0.764341
H  -1.394903 -2.820153 1.957999
H  -1.687118 -3.102525 0.246044
H  -4.137494 0.354714 -1.633228
H  -0.242533 0.750867 1.124632
H  -3.190474 -1.580557 2.547782
H  -3.947089 -1.837947 0.965723
H  -3.711218 -0.200223 1.592687
H  -3.892282 4.510596 -0.669555
H  -5.042397 2.646326 -1.793871
H  -2.050943 5.334844 0.701832
H  5.180407 -1.126677 0.80237
H  6.648733 -1.873404 0.165604
H  5.474658 -2.846991 1.056053
H  4.541748 -1.368765 -2.898363
H  4.628967 -0.251476 -1.537449
H  6.102299 -1.005929 -2.154594
H  5.344728 -4.470685 -0.92186
H  4.958912 -3.86712 -2.533101
H  6.518912 -3.485068 -1.798615
H  0.745844 -1.573841 1.39407
H  0.90516 2.624131 2.185875
H  0.001675 4.927588 1.991161
H  0.331909 -3.490607 -0.951469
totalener: -870.02510848 hartree
nucrepener: 1629.48953145 hartree
electener: -2499.51463993 hartree
oneelecener: -4410.76375266 hartree
twoeener: 1911.24911273 hartree
kineticenergy: 865.89050865 hartree
xcener: -88.996722671839 hartree
chargesum: 0.0000000
charge: -0.177478 -0.090661 0.043501 -0.068074 -0.035327 -0.002985 -0.071457 -0.082668 -0.157422 -0.194926 -0.098998 -0.124845 -0.071552 -0.260944 -0.259320 -0.261921 -0.096890 -0.124348 -0.118311 -0.246138 -0.203431 0.260927 0.079300 0.131612 0.086728 0.069373 0.098281 0.101165 0.088438 0.073611 0.107126 0.106654 0.120870 0.105145 0.093346 0.083999 0.094638 0.094554 0.096074 0.083820 0.094816 0.094278 0.084346 0.115635 0.119019 0.121264 0.099174
qa: -0.1775 -0.0907 0.0435 -0.0681 -0.0353 -0.0030 -0.0715 -0.0827 -0.1574 -0.1949 -0.0990 -0.1248 -0.0716 -0.2609 -0.2593 -0.2619 -0.0969 -0.1243 -0.1183 -0.2461 -0.2034 0.2609 0.0793 0.1316 0.0867 0.0694 0.0983 0.1012 0.0884 0.0736 0.1071 0.1067 0.1209 0.1051 0.0933 0.0840 0.0946 0.0946 0.0961 0.0838 0.0948 0.0943 0.0843 0.1156 0.1190 0.1213 0.0992
va: 2.8269 3.7531 3.5155 3.9394 3.9613 4.1320 3.9664 3.9356 3.9976 3.9700 3.9697 3.9943 3.9284 3.9008 3.9013 3.9029 3.8389 3.9879 3.9600 3.9705 4.0599 3.6645 1.0189 0.9908 0.9986 1.0127 1.0202 1.0493 1.0015 1.0017 0.9939 1.0140 1.0029 1.0143 1.0098 1.0067 1.0095 1.0098 1.0093 1.0064 1.0094 1.0094 1.0065 1.0201 1.0028 1.0009 1.0122
dispcorr: -0.019956273 hartree
energy: -870.045064752381
dipole: 17.56016 -17.50944 0.05072 -14.56238 14.37343 -0.18895 -1.94247 1.90425 -0.03821
magnitude: 0.19933 au
magnitude: 0.50666 debye
