program: Orca
programVersion: 5.0.2
elementType: N C C C C C C C C C C C C C C C C C C C C C H H H H H H H H H H H H H H H H H H H H H H H H H
charge: 0
multiplicity: 1
keywords: wb97x-d3
keywords: def2-TZVPP
keywords: def2/J RIJCOSX
keywords: DEFGRID2
keywords: scfconv7
keywords: smallprint printgap noloewdin
keywords: NOSOSCF
formula: C21H25N
InChI: InChI=1/C21H25N/c1-21(2,3)15-8-5-9-16-22(4)17-19-13-10-12-18-11-6-7-14-20(18)19/h5-7,9-14H,16-17H2,1-4H3
47 atoms
N  -1.949645 -1.129601 0.593851
C  -1.816687 -0.284582 -0.579167
C  -2.374003 1.101761 -0.398847
C  -1.843106 1.998403 0.573695
C  -2.377553 3.311101 0.666934
C  4.941282 -2.448685 -1.18286
C  -1.299757 -2.411076 0.398947
C  -3.391886 1.526786 -1.211792
C  -0.790951 1.639419 1.449131
C  -3.323737 -1.286545 1.011451
C  -3.428177 3.700304 -0.19502
C  -3.9258 2.82589 -1.115419
C  -1.845221 4.210564 1.617817
C  5.528568 -3.849935 -1.394941
C  5.546618 -1.818614 0.076795
C  5.248874 -1.568258 -2.400721
C  0.18231 -2.278911 0.27207
C  -0.294625 2.534223 2.356698
C  -0.825827 3.834217 2.445416
C  3.49018 -2.55639 -1.021587
C  0.885186 -2.744833 -0.76243
C  2.295521 -2.64018 -0.884941
H  -2.304193 -0.742573 -1.458323
H  -0.753672 -0.215289 -0.829588
H  -1.518812 -3.027361 1.277331
H  -1.702689 -2.959432 -0.471766
H  -3.796864 0.845532 -1.950636
H  -0.3954 0.635173 1.414283
H  -3.364673 -1.886519 1.921123
H  -3.95829 -1.77596 0.254947
H  -3.765145 -0.317246 1.238349
H  -3.83016 4.702978 -0.114154
H  -4.729874 3.123482 -1.775319
H  -2.26018 5.209417 1.679347
H  5.316171 -4.498256 -0.544957
H  6.612042 -3.790463 -1.514425
H  5.114285 -4.31907 -2.287452
H  5.14254 -0.821597 0.252361
H  5.341162 -2.42528 0.958749
H  6.629627 -1.731681 -0.029517
H  4.82534 -1.99236 -3.311112
H  4.840357 -0.565485 -2.275284
H  6.328442 -1.480201 -2.5378
H  0.695695 -1.779002 1.087279
H  0.509796 2.238961 3.017608
H  -0.426042 4.531642 3.169784
H  0.363668 -3.239523 -1.577723
totalener: -870.02520590 hartree
nucrepener: 1622.03761474 hartree
electener: -2492.06282064 hartree
oneelecener: -4395.85400316 hartree
twoeener: 1903.79118252 hartree
kineticenergy: 865.89311098 hartree
xcener: -88.997244368725 hartree
chargesum: -0.0000000
charge: -0.175970 -0.088357 0.061341 -0.083798 -0.032308 -0.002174 -0.075785 -0.079518 -0.165595 -0.194140 -0.100417 -0.127433 -0.069706 -0.261415 -0.262731 -0.260630 -0.094573 -0.123016 -0.120112 -0.241927 -0.204555 0.258684 0.076756 0.130529 0.086853 0.068864 0.098247 0.104596 0.088982 0.074464 0.106682 0.106747 0.120532 0.105098 0.095180 0.084501 0.093797 0.095067 0.093952 0.083995 0.093679 0.096602 0.083971 0.116625 0.119243 0.121777 0.097397
qa: -0.1760 -0.0884 0.0613 -0.0838 -0.0323 -0.0022 -0.0758 -0.0795 -0.1656 -0.1941 -0.1004 -0.1274 -0.0697 -0.2614 -0.2627 -0.2606 -0.0946 -0.1230 -0.1201 -0.2419 -0.2046 0.2587 0.0768 0.1305 0.0869 0.0689 0.0982 0.1046 0.0890 0.0745 0.1067 0.1067 0.1205 0.1051 0.0952 0.0845 0.0938 0.0951 0.0940 0.0840 0.0937 0.0966 0.0840 0.1166 0.1192 0.1218 0.0974
va: 2.8355 3.7560 3.5157 3.9338 3.9588 4.1275 3.9683 3.9337 3.9925 3.9677 3.9700 3.9941 3.9242 3.9034 3.9031 3.9029 3.8393 3.9857 3.9623 3.9747 4.0673 3.6769 1.0184 0.9907 0.9985 1.0127 1.0201 1.0564 1.0010 1.0023 0.9944 1.0138 1.0030 1.0142 1.0094 1.0064 1.0094 1.0095 1.0093 1.0068 1.0095 1.0090 1.0063 1.0206 1.0028 1.0007 1.0128
dispcorr: -0.019847085 hartree
energy: -870.045052981703
dipole: 17.83482 -17.77716 0.05766 -15.38722 15.18570 -0.20152 -4.17364 4.08567 -0.08797
magnitude: 0.22732 au
magnitude: 0.57781 debye
