program: Orca
programVersion: 5.0.2
elementType: N C C C C C C C C C C C C C C C C C C C C C H H H H H H H H H H H H H H H H H H H H H H H H H
charge: 0
multiplicity: 1
keywords: wb97x-d3
keywords: def2-TZVPP
keywords: def2/J RIJCOSX
keywords: DEFGRID2
keywords: scfconv7
keywords: smallprint printgap noloewdin
keywords: NOSOSCF
formula: C21H25N
InChI: InChI=1/C21H25N/c1-21(2,3)15-8-5-9-16-22(4)17-19-13-10-12-18-11-6-7-14-20(18)19/h5-7,9-14H,16-17H2,1-4H3
47 atoms
N  -1.847771 -0.788049 -0.846285
C  -1.327279 0.421803 -1.447414
C  -1.202538 1.560944 -0.472199
C  -2.352191 2.142823 0.135851
C  -2.184022 3.237866 1.024223
C  4.851569 -3.164641 -0.210248
C  -1.258187 -1.211723 0.396633
C  0.03843 2.05497 -0.168404
C  -3.665059 1.67624 -0.112889
C  -2.167208 -1.82502 -1.79357
C  -0.882578 3.716175 1.300671
C  0.205665 3.135061 0.719396
C  -3.32142 3.830807 1.616991
C  5.793829 -1.954767 -0.181193
C  5.211407 -4.070688 -1.394113
C  4.980581 -3.950394 1.100357
C  0.164534 -1.685832 0.428676
C  -4.746223 2.271989 0.476023
C  -4.576385 3.362524 1.349154
C  3.47195 -2.695441 -0.356744
C  0.996823 -1.850242 -0.60289
C  2.335221 -2.307396 -0.460935
H  -2.017338 0.707689 -2.250101
H  -0.35168 0.282143 -1.936088
H  -1.348289 -0.394606 1.120377
H  -1.887056 -2.010188 0.808297
H  0.912958 1.600969 -0.618468
H  -3.809743 0.819667 -0.755579
H  -1.314041 -2.230337 -2.354492
H  -2.883355 -1.444981 -2.52631
H  -2.64287 -2.660631 -1.278803
H  -0.763735 4.550248 1.981741
H  1.201534 3.498681 0.935078
H  -3.182002 4.667278 2.291198
H  5.556368 -1.291332 0.650381
H  5.720433 -1.377503 -1.102999
H  6.828703 -2.284378 -0.068457
H  5.130881 -3.534574 -2.339853
H  6.23757 -4.430288 -1.295419
H  4.552001 -4.937336 -1.441975
H  4.728596 -3.327331 1.958577
H  4.318914 -4.816615 1.10772
H  6.005158 -4.305352 1.228183
H  0.536454 -1.915535 1.423723
H  -5.741922 1.899109 0.27433
H  -5.440472 3.82401 1.808744
H  0.671981 -1.635366 -1.614498
totalener: -870.01984964 hartree
nucrepener: 1638.95786105 hartree
electener: -2508.97771069 hartree
oneelecener: -4429.72866964 hartree
twoeener: 1920.75095896 hartree
kineticenergy: 865.88504099 hartree
xcener: -89.003494244752 hartree
chargesum: -0.0000000
charge: -0.203767 -0.116922 0.172032 -0.155708 -0.014339 0.000860 -0.028114 -0.115962 -0.197933 -0.171038 -0.120800 -0.116810 -0.056120 -0.260304 -0.262364 -0.262514 -0.067299 -0.122752 -0.122787 -0.225051 -0.255666 0.249890 0.112887 0.093496 0.097961 0.087338 0.111309 0.119734 0.083263 0.084212 0.085964 0.106968 0.122692 0.105598 0.094414 0.093181 0.083816 0.092955 0.084130 0.094976 0.093116 0.094357 0.083794 0.094986 0.121069 0.121626 0.089625
qa: -0.2038 -0.1169 0.1720 -0.1557 -0.0143 0.0009 -0.0281 -0.1160 -0.1979 -0.1710 -0.1208 -0.1168 -0.0561 -0.2603 -0.2624 -0.2625 -0.0673 -0.1228 -0.1228 -0.2251 -0.2557 0.2499 0.1129 0.0935 0.0980 0.0873 0.1113 0.1197 0.0833 0.0842 0.0860 0.1070 0.1227 0.1056 0.0944 0.0932 0.0838 0.0930 0.0841 0.0950 0.0931 0.0944 0.0838 0.0950 0.1211 0.1216 0.0896
va: 2.8479 3.8252 3.4010 3.9730 3.9512 4.1319 4.0106 3.9585 3.9999 3.9576 3.9939 3.9901 3.9167 3.9020 3.9030 3.9026 3.7338 3.9892 3.9696 3.9618 4.0104 3.7418 0.9922 0.9986 0.9934 0.9969 1.0102 1.0327 0.9887 0.9959 1.0005 1.0141 1.0023 1.0140 1.0094 1.0099 1.0065 1.0098 1.0064 1.0095 1.0100 1.0095 1.0067 1.0231 1.0029 1.0010 1.0150
dispcorr: -0.020847683 hartree
energy: -870.040697320893
dipole: 19.73254 -19.63614 0.09639 -19.50205 19.33370 -0.16835 -3.77676 3.84912 0.07236
magnitude: 0.20705 au
magnitude: 0.52629 debye
