program: Orca
programVersion: 5.0.2
elementType: N C C C C C C C C C C C C C C C C C C C C C H H H H H H H H H H H H H H H H H H H H H H H H H
charge: 0
multiplicity: 1
keywords: wb97x-d3
keywords: def2-TZVPP
keywords: def2/J RIJCOSX
keywords: DEFGRID2
keywords: scfconv7
keywords: smallprint printgap noloewdin
keywords: NOSOSCF
formula: C21H25N
InChI: InChI=1/C21H25N/c1-21(2,3)15-8-5-9-16-22(4)17-19-13-10-12-18-11-6-7-14-20(18)19/h5-7,9-14H,16-17H2,1-4H3
47 atoms
N  -2.174033 -1.528359 0.035093
C  -1.961625 -0.240107 -0.591979
C  -1.825865 0.897028 0.392264
C  -1.860029 2.244238 -0.071808
C  -1.718392 3.304734 0.861777
C  4.706517 -2.545402 -0.332809
C  -1.715925 -2.626389 -0.784383
C  -1.631901 0.656767 1.726899
C  -2.014872 2.578269 -1.4385
C  -3.550947 -1.699208 0.44528
C  -1.536036 3.006583 2.231046
C  -1.489122 1.710348 2.650636
C  -1.752655 4.640631 0.403918
C  5.305942 -1.169766 -0.651364
C  5.05415 -3.534114 -1.45232
C  5.267635 -3.054807 1.000649
C  -0.227896 -2.761607 -0.862982
C  -2.038395 3.881306 -1.853337
C  -1.909436 4.927764 -0.92251
C  3.250937 -2.422596 -0.231021
C  0.645222 -2.15587 -0.055472
C  2.052297 -2.31625 -0.159017
H  -2.774146 -0.019443 -1.304315
H  -1.044881 -0.286213 -1.187296
H  -2.116372 -3.555583 -0.36333
H  -2.123673 -2.581547 -1.810802
H  -1.589323 -0.367087 2.074542
H  -2.110051 1.794565 -2.177575
H  -4.251173 -1.744619 -0.403603
H  -3.859957 -0.870744 1.081914
H  -3.66096 -2.617804 1.022746
H  -1.428927 3.820715 2.937447
H  -1.342314 1.480482 3.697823
H  -1.647359 5.440564 1.1269
H  4.924429 -0.7830 -1.596332
H  6.392873 -1.240178 -0.726604
H  5.06633 -0.446411 0.127836
H  4.637474 -4.520607 -1.248802
H  4.663454 -3.19535 -2.411857
H  6.13728 -3.635759 -1.543974
H  4.855636 -4.031561 1.253796
H  6.353674 -3.1490 0.940351
H  5.031833 -2.369092 1.814294
H  0.142017 -3.425316 -1.637274
H  -2.155035 4.109726 -2.904533
H  -1.930918 5.955469 -1.259936
H  0.283539 -1.495866 0.726664
totalener: -870.02330461 hartree
nucrepener: 1628.65774947 hartree
electener: -2498.68105408 hartree
oneelecener: -4409.16099951 hartree
twoeener: 1910.47994543 hartree
kineticenergy: 865.88280787 hartree
xcener: -89.000292864500 hartree
chargesum: 0.0000000
charge: -0.177573 -0.137746 0.227205 -0.156761 0.015442 0.001206 -0.032378 -0.222188 -0.184777 -0.189165 -0.123897 -0.108303 -0.074152 -0.259677 -0.263567 -0.262217 -0.119747 -0.135294 -0.112917 -0.223950 -0.236640 0.263480 0.087613 0.131788 0.082446 0.074013 0.131997 0.115440 0.078049 0.104472 0.090984 0.105918 0.122430 0.105703 0.093932 0.082921 0.095053 0.093656 0.092963 0.083317 0.094528 0.083335 0.094572 0.100885 0.120689 0.122844 0.124066
qa: -0.1776 -0.1377 0.2272 -0.1568 0.0154 0.0012 -0.0324 -0.2222 -0.1848 -0.1892 -0.1239 -0.1083 -0.0742 -0.2597 -0.2636 -0.2622 -0.1197 -0.1353 -0.1129 -0.2240 -0.2366 0.2635 0.0876 0.1318 0.0824 0.0740 0.1320 0.1154 0.0780 0.1045 0.0910 0.1059 0.1224 0.1057 0.0939 0.0829 0.0951 0.0937 0.0930 0.0833 0.0945 0.0833 0.0946 0.1009 0.1207 0.1228 0.1241
va: 2.8527 3.8904 3.3842 4.0848 3.9091 4.1289 3.9636 3.9395 4.0014 3.9336 3.9949 4.0068 3.9339 3.9027 3.9045 3.9032 3.8558 4.0095 3.9663 3.9631 4.0170 3.7104 1.0002 0.9807 0.9923 1.0036 1.0342 1.0167 1.0049 0.9966 0.9994 1.0146 1.0024 1.0147 1.0095 1.0064 1.0097 1.0093 1.0096 1.0069 1.0096 1.0064 1.0096 1.0205 1.0042 1.0007 1.0050
dispcorr: -0.019533416 hartree
energy: -870.042838022651
dipole: 15.52568 -15.69093 -0.16525 -16.69497 16.52314 -0.17183 -3.56690 3.29496 -0.27194
magnitude: 0.36164 au
magnitude: 0.91922 debye
