program: Orca
programVersion: 5.0.2
elementType: N C C C C C C C C C C C C C C C C C C C C C H H H H H H H H H H H H H H H H H H H H H H H H H
charge: 0
multiplicity: 1
keywords: wb97x-d3
keywords: def2-TZVPP
keywords: def2/J RIJCOSX
keywords: DEFGRID2
keywords: scfconv7
keywords: smallprint printgap noloewdin
keywords: NOSOSCF
formula: C21H25N
InChI: InChI=1/C21H25N/c1-21(2,3)15-8-5-9-16-22(4)17-19-13-10-12-18-11-6-7-14-20(18)19/h5-7,9-14H,16-17H2,1-4H3
47 atoms
N  -1.879433 -1.362213 0.731861
C  -1.408099 -0.107667 0.188552
C  -2.373306 1.036115 0.397256
C  -1.933835 2.38288 0.240176
C  -2.86187 3.441951 0.430033
C  5.021527 -2.821246 -0.921429
C  -1.338227 -2.520916 0.043351
C  -3.68799 0.793707 0.695712
C  -0.60622 2.721007 -0.11746
C  -1.746425 -1.428503 2.170074
C  -4.202212 3.141812 0.760113
C  -4.60564 1.844819 0.881685
C  -2.430601 4.778911 0.278158
C  5.461338 -3.478035 0.392655
C  5.621117 -1.412421 -1.021027
C  5.491539 -3.669972 -2.10954
C  0.156182 -2.650532 0.094158
C  -0.219825 4.024822 -0.264266
C  -1.139589 5.0693 -0.060066
C  3.560603 -2.730016 -0.944355
C  0.940425 -2.567784 -0.983318
C  2.357211 -2.658386 -0.950882
H  -1.252843 -0.233278 -0.888525
H  -0.420582 0.156767 0.595698
H  -1.80068 -3.410616 0.48238
H  -1.665448 -2.486436 -0.99988
H  -4.019632 -0.231844 0.790859
H  0.12305 1.940914 -0.287787
H  -2.306142 -0.616534 2.634391
H  -0.708849 -1.353385 2.527552
H  -2.164048 -2.366297 2.538907
H  -4.902619 3.95485 0.907367
H  -5.634889 1.613974 1.12358
H  -3.147608 5.576501 0.431547
H  5.132483 -2.89474 1.252861
H  6.549705 -3.553922 0.430319
H  5.04822 -4.482063 0.489359
H  5.299961 -0.786802 -0.188249
H  6.711301 -1.466089 -1.003472
H  5.320831 -0.920957 -1.946478
H  5.188478 -3.223729 -3.05676
H  6.580131 -3.751726 -2.106392
H  5.075857 -4.676487 -2.063856
H  0.617491 -2.797284 1.065611
H  0.800976 4.255126 -0.539666
H  -0.822937 6.097484 -0.174966
H  0.487591 -2.420461 -1.960877
totalener: -870.02221005 hartree
nucrepener: 1600.91389518 hartree
electener: -2470.93610523 hartree
oneelecener: -4353.54951977 hartree
twoeener: 1882.61341454 hartree
kineticenergy: 865.88679535 hartree
xcener: -88.999576672565 hartree
chargesum: -0.0000000
charge: -0.169520 -0.048014 0.147809 -0.130209 0.010536 -0.001133 -0.084165 -0.217440 -0.199403 -0.190139 -0.125645 -0.088051 -0.074778 -0.262248 -0.260428 -0.261241 -0.077922 -0.136217 -0.115634 -0.248539 -0.203860 0.249554 0.095818 0.086975 0.093678 0.085608 0.131302 0.121446 0.104144 0.078255 0.091716 0.105562 0.121295 0.105309 0.093475 0.084120 0.095076 0.094902 0.084882 0.094676 0.094161 0.084250 0.095233 0.105500 0.120556 0.122533 0.096213
qa: -0.1695 -0.0480 0.1478 -0.1302 0.0105 -0.0011 -0.0842 -0.2174 -0.1994 -0.1901 -0.1256 -0.0881 -0.0748 -0.2622 -0.2604 -0.2612 -0.0779 -0.1362 -0.1156 -0.2485 -0.2039 0.2496 0.0958 0.0870 0.0937 0.0856 0.1313 0.1214 0.1041 0.0783 0.0917 0.1056 0.1213 0.1053 0.0935 0.0841 0.0951 0.0949 0.0849 0.0947 0.0942 0.0843 0.0952 0.1055 0.1206 0.1225 0.0962
va: 2.8832 3.8619 3.4946 4.0410 3.9102 4.1280 3.9877 3.9764 4.0158 3.9402 3.9937 3.9572 3.9325 3.9030 3.9014 3.9037 3.7092 4.0070 3.9652 3.9750 4.0430 3.6672 0.9948 0.9913 0.9982 1.0067 1.0391 1.0150 0.9966 1.0015 0.9986 1.0147 1.0024 1.0146 1.0098 1.0069 1.0092 1.0091 1.0065 1.0094 1.0095 1.0065 1.0094 1.0171 1.0040 1.0007 1.0121
dispcorr: -0.019122607 hartree
energy: -870.041332659153
dipole: 22.70032 -22.26500 0.43532 -17.04834 16.83438 -0.21395 -0.00140 0.09767 0.09627
magnitude: 0.49452 au
magnitude: 1.25697 debye
