program: Orca
programVersion: 4.2.1
elementType: Cl O N N N C C C C C C C C C C C C C C C C H H H H H H H H H H H H H H H H H H H H H H
charge: 0
multiplicity: 1
keywords: wb97x-d3
keywords: def2-TZVPP
keywords: def2/J RIJCOSX GRIDX6 NOFINALGRIDX
keywords: grid4 nofinalgrid
keywords: scfconv7
keywords: smallprint printgap noloewdin
keywords: NOSOSCF
formula: C16H22ClN3O
InChI: InChI=1/C16H22ClN3O/c1-15(2,3)16(21,10-20-12-18-11-19-20)9-8-13-4-6-14(17)7-5-13/h4-7,11-12,21H,8-10H2,1-3H3
43 atoms
Cl 4.849694 4.550647 -0.617649
O  -1.217637 -1.086313 1.676598
N  -1.860087 -3.145603 -0.341514
N  -1.966537 -3.679654 0.878947
N  -3.223296 -4.823245 -0.577343
C  -1.37289 -0.747167 0.311734
C  -2.807439 -0.143705 0.069143
C  -0.280235 0.295334 -0.004321
C  -1.051056 -1.969184 -0.576964
C  -2.979317 1.150151 0.878504
C  -3.045817 0.180361 -1.407716
C  -3.927418 -1.087146 0.534753
C  1.151769 -0.098786 0.377777
C  2.094753 1.046415 0.136263
C  -2.614189 -3.834105 -1.193515
C  2.179234 2.100474 1.043867
C  2.880205 1.104842 -1.010907
C  -2.797279 -4.674974 0.687266
C  3.019839 3.179965 0.821729
C  3.730123 2.175387 -1.25188
C  3.790856 3.206889 -0.330062
H  -0.512007 1.220431 0.523972
H  -0.306775 0.540082 -1.068585
H  -1.147412 -1.717056 -1.630284
H  -0.014766 -2.263037 -0.418318
H  -2.765382 1.000221 1.937705
H  -4.014175 1.49095 0.801636
H  -2.35604 1.970002 0.520004
H  -2.304767 0.871278 -1.811229
H  -4.021523 0.655115 -1.526751
H  -3.053546 -0.709076 -2.040645
H  -4.881243 -0.559362 0.472654
H  -4.037448 -1.976603 -0.083275
H  -3.811229 -1.398146 1.573291
H  1.496131 -0.960135 -0.196771
H  1.18824 -0.384117 1.429646
H  -1.582956 -1.971353 1.825861
H  -2.685315 -3.593573 -2.242587
H  1.582193 2.082017 1.947809
H  2.837327 0.299201 -1.733711
H  -3.097431 -5.321824 1.496112
H  3.07302 3.985795 1.540917
H  4.336297 2.198316 -2.14715
elementType: Cl O N C H
totalener: -1322.72956112 hartree
nucrepener: 1800.96924405 hartree
electener: -3123.69880517 hartree
oneelecener: -5383.32687921 hartree
twoeener: 2259.62807404 hartree
cpcmener: -0.02993217 hartree
kineticenergy: 1318.19201043 hartree
xcener: -106.467610414640 hartree
chargesum: 0.0000000
charge: -0.108089 -0.486239 0.142763 -0.381341 -0.411836 0.513491 0.238310 -0.318258 -0.290965 -0.371015 -0.370812 -0.388360 -0.022339 -0.002413 0.054550 -0.231674 -0.207128 0.087725 -0.150310 -0.147349 0.087942 0.120361 0.109727 0.135464 0.168141 0.103665 0.098330 0.096251 0.107567 0.102128 0.094352 0.102832 0.104636 0.101627 0.078503 0.097957 0.226637 0.176159 0.145069 0.141309 0.164245 0.144149 0.144236
qa: -0.1081 -0.4862 0.1428 -0.3813 -0.4118 0.5135 0.2383 -0.3183 -0.2910 -0.3710 -0.3708 -0.3884 -0.0223 -0.0024 0.0545 -0.2317 -0.2071 0.0877 -0.1503 -0.1473 0.0879 0.1204 0.1097 0.1355 0.1681 0.1037 0.0983 0.0963 0.1076 0.1021 0.0944 0.1028 0.1046 0.1016 0.0785 0.0980 0.2266 0.1762 0.1451 0.1413 0.1642 0.1441 0.1442
va: 1.1974 1.9438 3.3098 2.8534 3.0209 3.5419 3.7251 3.8906 4.0007 3.9093 3.9567 3.9324 3.7237 3.6023 4.0501 3.9813 3.9684 4.0079 3.9750 3.9725 3.8103 0.9978 1.0093 0.9859 0.9838 1.0209 1.0073 0.9984 1.0006 1.0036 0.9999 1.0105 0.9957 1.0171 1.0282 1.0313 1.0624 0.9939 1.0033 1.0044 0.9938 1.0047 1.0050
dispcorr: -0.023214756 hartree
energy: -1322.752775878474
dipole: -31.22422 30.80477 -0.41945 -10.37631 10.25810 -0.11821 0.54305 -1.83371 -1.29066
magnitude: 1.36225 au
magnitude: 3.46255 debye
