program: Orca
programVersion: 4.2.1
elementType: Cl O N N N C C C C C C C C C C C C C C C C H H H H H H H H H H H H H H H H H H H H H H
charge: 0
multiplicity: 1
keywords: wb97x-d3
keywords: def2-TZVPP
keywords: def2/J RIJCOSX GRIDX6 NOFINALGRIDX
keywords: grid4 nofinalgrid
keywords: scfconv7
keywords: smallprint printgap noloewdin
keywords: NOSOSCF
formula: C16H22ClN3O
InChI: InChI=1/C16H22ClN3O/c1-15(2,3)16(21,10-20-12-18-11-19-20)9-8-13-4-6-14(17)7-5-13/h4-7,11-12,21H,8-10H2,1-3H3
43 atoms
Cl 4.8264 4.557922 -0.740262
O  -1.079643 -0.8514 1.728293
N  -1.901743 -3.163337 0.055948
N  -1.943156 -3.548154 1.335668
N  -3.347385 -4.786202 0.108389
C  -1.338837 -0.71927 0.342269
C  -2.793352 -0.161726 0.108661
C  -0.289192 0.282049 -0.173979
C  -1.064275 -2.062077 -0.366809
C  -3.852858 -0.911149 0.93025
C  -2.869618 1.306517 0.551304
C  -3.193448 -0.234146 -1.367825
C  1.170835 -0.186777 -0.119514
C  2.107288 0.977569 -0.276869
C  -2.743387 -3.906189 -0.658117
C  2.699052 1.270867 -1.501227
C  2.373985 1.819677 0.801391
C  -2.8256 -4.517008 1.316699
C  3.535779 2.368182 -1.654528
C  3.20627 2.919876 0.670087
C  3.781484 3.184926 -0.563577
H  -0.37126 1.183623 0.435159
H  -0.52449 0.583875 -1.196957
H  -1.174541 -1.965047 -1.445223
H  -0.033714 -2.361668 -0.179039
H  -4.817973 -0.420502 0.791739
H  -3.642588 -0.889436 1.999959
H  -3.999957 -1.947554 0.632171
H  -3.906126 1.645567 0.514595
H  -2.2981 1.97444 -0.092779
H  -2.521101 1.445292 1.575895
H  -2.470772 0.253022 -2.024421
H  -3.326337 -1.257616 -1.722342
H  -4.149824 0.270829 -1.51723
H  1.37593 -0.913598 -0.906949
H  1.368037 -0.683838 0.832693
H  -1.464128 -1.68171 2.043034
H  -2.876467 -3.786638 -1.721627
H  2.511208 0.633004 -2.35634
H  1.926829 1.613968 1.766849
H  -3.094973 -5.053246 2.213003
H  3.988931 2.57794 -2.613938
H  3.403338 3.559453 1.519837
elementType: Cl O N C H
totalener: -1322.73100367 hartree
nucrepener: 1803.53159581 hartree
electener: -3126.26259948 hartree
oneelecener: -5388.45252867 hartree
twoeener: 2262.18992919 hartree
cpcmener: -0.03018746 hartree
kineticenergy: 1318.18898064 hartree
xcener: -106.466470415062 hartree
chargesum: -0.0000000
charge: -0.108355 -0.477953 0.137848 -0.380130 -0.409920 0.492614 0.213595 -0.288851 -0.272641 -0.371958 -0.363289 -0.367177 -0.008325 -0.013382 0.057601 -0.194948 -0.237596 0.079058 -0.163524 -0.154382 0.097393 0.104421 0.112032 0.133833 0.161205 0.101740 0.100586 0.096478 0.097778 0.098308 0.100132 0.108917 0.095946 0.102720 0.075012 0.103361 0.228478 0.175223 0.141856 0.143254 0.163783 0.144645 0.144611
qa: -0.1084 -0.4780 0.1378 -0.3801 -0.4099 0.4926 0.2136 -0.2889 -0.2726 -0.3720 -0.3633 -0.3672 -0.0083 -0.0134 0.0576 -0.1949 -0.2376 0.0791 -0.1635 -0.1544 0.0974 0.1044 0.1120 0.1338 0.1612 0.1017 0.1006 0.0965 0.0978 0.0983 0.1001 0.1089 0.0959 0.1027 0.0750 0.1034 0.2285 0.1752 0.1419 0.1433 0.1638 0.1446 0.1446
va: 1.1971 1.9619 3.3148 2.8471 3.0196 3.5811 3.7214 3.8702 3.9669 3.9304 3.9160 3.9523 3.7023 3.5994 4.0507 3.9663 3.9833 4.0150 3.9855 3.9782 3.8046 1.0048 1.0122 0.9849 0.9852 1.0100 1.0148 1.0003 1.0086 0.9954 1.0182 1.0041 1.0021 1.0042 1.0190 1.0265 1.0528 0.9939 1.0043 1.0070 0.9945 1.0056 1.0050
dispcorr: -0.023284340 hartree
energy: -1322.754288008079
dipole: -31.11958 30.63566 -0.48391 -11.01865 10.69459 -0.32406 -0.17089 -1.27092 -1.44182
magnitude: 1.55500 au
magnitude: 3.95249 debye
