program: Orca
programVersion: 4.2.1
elementType: Cl O N N N C C C C C C C C C C C C C C C C H H H H H H H H H H H H H H H H H H H H H H
charge: 0
multiplicity: 1
keywords: wb97x-d3
keywords: def2-TZVPP
keywords: def2/J RIJCOSX GRIDX6 NOFINALGRIDX
keywords: grid4 nofinalgrid
keywords: scfconv7
keywords: smallprint printgap noloewdin
keywords: NOSOSCF
formula: C16H22ClN3O
InChI: InChI=1/C16H22ClN3O/c1-15(2,3)16(21,10-20-12-18-11-19-20)9-8-13-4-6-14(17)7-5-13/h4-7,11-12,21H,8-10H2,1-3H3
43 atoms
Cl 5.103865 2.189603 -1.869123
O  -2.552132 0.036534 1.877439
N  -1.218926 -2.403406 0.739531
N  -0.913851 -2.659266 2.013955
N  0.729054 -3.369852 0.659034
C  -2.421315 -0.200945 0.489134
C  -3.662376 0.384741 -0.277163
C  -1.103611 0.396667 -0.062256
C  -2.433984 -1.731294 0.34204
C  -4.94631 -0.366776 0.094142
C  -3.869914 1.856966 0.100844
C  -3.4731 0.302565 -1.795132
C  0.04278 0.535836 0.948557
C  1.313236 0.950916 0.260174
C  -0.231947 -2.826545 -0.050485
C  1.549106 2.284873 -0.064414
C  2.275288 0.009608 -0.095957
C  0.259097 -3.232376 1.912651
C  2.707318 2.674973 -0.72007
C  3.441049 0.378748 -0.751085
C  3.646893 1.713638 -1.057922
H  -1.29039 1.391582 -0.472443
H  -0.765955 -0.197053 -0.916156
H  -3.247278 -2.159847 0.925214
H  -2.603196 -2.004582 -0.697474
H  -5.808868 0.14102 -0.341296
H  -5.10137 -0.402575 1.173283
H  -4.963575 -1.389793 -0.284248
H  -4.674976 2.276821 -0.5044
H  -2.989011 2.476909 -0.076073
H  -4.170467 1.984425 1.142536
H  -3.310277 -0.717109 -2.148771
H  -4.371375 0.668588 -2.295749
H  -2.640712 0.911693 -2.148425
H  0.215793 -0.388206 1.499112
H  -0.217769 1.289097 1.695101
H  -2.499824 0.984078 2.040771
H  -0.263376 -2.739659 -1.125469
H  0.822166 3.042081 0.204315
H  2.12262 -1.035104 0.146033
H  0.795463 -3.576809 2.782909
H  2.875209 3.716556 -0.957909
H  4.178524 -0.36796 -1.012519
elementType: Cl O N C H
totalener: -1322.72898900 hartree
nucrepener: 1848.98052339 hartree
electener: -3171.70951238 hartree
oneelecener: -5479.52917780 hartree
twoeener: 2307.81966542 hartree
cpcmener: -0.03553379 hartree
kineticenergy: 1318.18831331 hartree
xcener: -106.462724531330 hartree
chargesum: 0.0000000
charge: -0.107421 -0.428552 0.133640 -0.356391 -0.415884 0.509810 0.172427 -0.396802 -0.221673 -0.356236 -0.363645 -0.344729 -0.043491 0.027361 0.040955 -0.226524 -0.206548 0.071041 -0.153943 -0.168267 0.095681 0.120247 0.117632 0.123158 0.143946 0.099858 0.100367 0.096787 0.098731 0.113273 0.094839 0.100272 0.100320 0.098559 0.095997 0.101616 0.218282 0.177130 0.144863 0.146067 0.160536 0.144456 0.142256
qa: -0.1074 -0.4286 0.1336 -0.3564 -0.4159 0.5098 0.1724 -0.3968 -0.2217 -0.3562 -0.3636 -0.3447 -0.0435 0.0274 0.0410 -0.2265 -0.2065 0.0710 -0.1539 -0.1683 0.0957 0.1202 0.1176 0.1232 0.1439 0.0999 0.1004 0.0968 0.0987 0.1133 0.0948 0.1003 0.1003 0.0986 0.0960 0.1016 0.2183 0.1771 0.1449 0.1461 0.1605 0.1445 0.1423
va: 1.1978 1.9997 3.3517 2.8649 2.9992 3.4867 3.8480 3.9508 3.9176 3.9074 3.9224 3.9295 3.6919 3.5856 4.0405 4.0071 3.9447 4.0158 3.9801 4.0427 3.8052 1.0080 0.9981 1.0137 0.9939 1.0056 1.0209 0.9980 1.0047 1.0002 1.0097 1.0076 1.0050 1.0014 1.0341 1.0240 1.0177 0.9945 1.0024 1.0236 0.9970 1.0049 1.0084
dispcorr: -0.024383818 hartree
energy: -1322.753372813942
dipole: -42.41523 40.16262 -2.25261 0.57456 0.55365 1.12821 1.17700 -2.30051 -1.12351
magnitude: 2.75851 au
magnitude: 7.01158 debye
