program: Orca
programVersion: 4.2.1
elementType: Cl O N N N C C C C C C C C C C C C C C C C H H H H H H H H H H H H H H H H H H H H H H
charge: 0
multiplicity: 1
keywords: wb97x-d3
keywords: def2-TZVPP
keywords: def2/J RIJCOSX GRIDX6 NOFINALGRIDX
keywords: grid4 nofinalgrid
keywords: scfconv7
keywords: smallprint printgap noloewdin
keywords: NOSOSCF
formula: C16H22ClN3O
InChI: InChI=1/C16H22ClN3O/c1-15(2,3)16(21,10-20-12-18-11-19-20)9-8-13-4-6-14(17)7-5-13/h4-7,11-12,21H,8-10H2,1-3H3
43 atoms
Cl 3.971314 3.597547 1.240632
O  -0.690165 -0.444878 1.082957
N  -1.367318 -2.901059 -0.392987
N  -0.281506 -3.213849 0.32385
N  -0.274701 -4.325619 -1.620567
C  -1.69458 -0.484052 0.092128
C  -2.779994 0.550649 0.534608
C  -1.136851 -0.1388 -1.315898
C  -2.308519 -1.900987 0.061754
C  -3.411329 0.15865 1.876576
C  -2.141584 1.933556 0.716776
C  -3.897826 0.663686 -0.506209
C  0.363599 -0.350459 -1.544326
C  1.258004 0.631828 -0.835744
C  -1.341653 -3.562343 -1.5476
C  2.244463 0.205243 0.047345
C  1.141635 1.999408 -1.072131
C  0.339318 -4.067166 -0.45421
C  3.084593 1.104561 0.687791
C  1.967056 2.916863 -0.44074
C  2.933494 2.458839 0.440648
H  -1.357388 0.89983 -1.563392
H  -1.676645 -0.716596 -2.07107
H  -2.652249 -2.19898 1.050819
H  -3.159824 -1.948643 -0.613486
H  -2.664974 0.036579 2.661366
H  -3.997265 -0.759794 1.820863
H  -4.097149 0.943884 2.199671
H  -1.358331 1.927996 1.473408
H  -2.904246 2.645589 1.038166
H  -1.707845 2.3285 -0.202387
H  -3.532843 0.965579 -1.488606
H  -4.45488 -0.266436 -0.631063
H  -4.618871 1.419302 -0.188673
H  0.531417 -0.248894 -2.620029
H  0.679961 -1.366502 -1.301728
H  -0.14383 -1.239448 1.015408
H  -2.118214 -3.474873 -2.290689
H  2.366602 -0.8528 0.247402
H  0.395114 2.3677 -1.76561
H  1.269864 -4.526098 -0.160029
H  3.842442 0.749785 1.373043
H  1.857558 3.974619 -0.638611
elementType: Cl O N C H
totalener: -1322.72707510 hartree
nucrepener: 1889.84897349 hartree
electener: -3212.57604859 hartree
oneelecener: -5561.54456597 hartree
twoeener: 2348.96851738 hartree
cpcmener: -0.03036433 hartree
kineticenergy: 1318.20009367 hartree
xcener: -106.469105264156 hartree
chargesum: -0.0000000
charge: -0.111548 -0.442359 0.122703 -0.396139 -0.408234 0.449693 0.220549 -0.295238 -0.207673 -0.372870 -0.363163 -0.355233 -0.125175 0.157655 0.063561 -0.241029 -0.296513 0.084845 -0.145262 -0.134126 0.079239 0.108073 0.113680 0.143297 0.125968 0.102061 0.095208 0.099492 0.097607 0.104358 0.091606 0.102626 0.098073 0.100445 0.109615 0.094738 0.215237 0.178992 0.136027 0.147602 0.163798 0.143249 0.144567
qa: -0.1115 -0.4424 0.1227 -0.3961 -0.4082 0.4497 0.2205 -0.2952 -0.2077 -0.3729 -0.3632 -0.3552 -0.1252 0.1577 0.0636 -0.2410 -0.2965 0.0848 -0.1453 -0.1341 0.0792 0.1081 0.1137 0.1433 0.1260 0.1021 0.0952 0.0995 0.0976 0.1044 0.0916 0.1026 0.0981 0.1004 0.1096 0.0947 0.2152 0.1790 0.1360 0.1476 0.1638 0.1432 0.1446
va: 1.1938 1.9930 3.3346 2.8255 3.0229 3.5695 3.7513 3.9173 3.9479 3.9237 3.9234 3.9316 3.8288 3.4503 4.0455 3.9956 4.0118 4.0098 4.0000 3.9573 3.8178 1.0034 1.0030 0.9939 0.9980 1.0198 1.0000 1.0050 1.0169 1.0080 1.0064 1.0018 1.0048 1.0047 1.0071 1.0062 1.0634 0.9917 1.0065 0.9993 0.9956 1.0050 1.0044
dispcorr: -0.025700121 hartree
energy: -1322.752775221190
dipole: -33.55951 31.22952 -2.32999 -4.29262 3.93239 -0.36022 -3.88705 2.73931 -1.14774
magnitude: 2.62220 au
magnitude: 6.66510 debye
