program: Orca
programVersion: 4.2.1
elementType: Cl O N N N C C C C C C C C C C C C C C C C H H H H H H H H H H H H H H H H H H H H H H
charge: 0
multiplicity: 1
keywords: wb97x-d3
keywords: def2-TZVPP
keywords: def2/J RIJCOSX GRIDX6 NOFINALGRIDX
keywords: grid4 nofinalgrid
keywords: scfconv7
keywords: smallprint printgap noloewdin
keywords: NOSOSCF
formula: C16H22ClN3O
InChI: InChI=1/C16H22ClN3O/c1-15(2,3)16(21,10-20-12-18-11-19-20)9-8-13-4-6-14(17)7-5-13/h4-7,11-12,21H,8-10H2,1-3H3
43 atoms
Cl 5.211797 2.942605 -0.966989
O  -2.524957 0.473398 1.943624
N  -1.515961 -2.641401 0.234456
N  -0.264249 -2.633968 -0.23257
N  -1.43746 -4.291175 -1.183391
C  -2.161223 -0.21389 0.75581
C  -3.268939 -0.006431 -0.338993
C  -0.826629 0.394318 0.313259
C  -1.986611 -1.68616 1.211541
C  -3.67677 1.473066 -0.395238
C  -2.793369 -0.399411 -1.742629
C  -4.534292 -0.811076 -0.013004
C  0.273463 0.419822 1.378819
C  1.520953 1.044896 0.822623
C  -2.19627 -3.634307 -0.338975
C  2.392732 0.303414 0.027857
C  1.814316 2.386735 1.045748
C  -0.268756 -3.633281 -1.077476
C  3.527712 0.876086 -0.525535
C  2.944757 2.979484 0.500895
C  3.793487 2.21493 -0.282229
H  -0.998754 1.419953 -0.021988
H  -0.452088 -0.150538 -0.551705
H  -1.295155 -1.706758 2.053124
H  -2.933003 -2.07324 1.589126
H  -2.833888 2.135899 -0.593117
H  -4.160255 1.811718 0.520686
H  -4.391414 1.61888 -1.207002
H  -1.991723 0.246045 -2.101424
H  -3.622009 -0.295878 -2.445804
H  -2.44871 -1.429795 -1.816741
H  -5.340105 -0.514085 -0.685895
H  -4.405105 -1.885763 -0.140688
H  -4.902944 -0.640983 1.001888
H  0.504133 -0.593227 1.713107
H  -0.054628 0.979996 2.254624
H  -3.409963 0.202148 2.21175
H  -3.226138 -3.853975 -0.107007
H  2.183325 -0.742308 -0.164325
H  1.152868 2.986296 1.659404
H  0.61387 -3.902178 -1.636388
H  4.195478 0.28376 -1.136373
H  3.157461 4.0230 0.689388
elementType: Cl O N C H
totalener: -1322.72782887 hartree
nucrepener: 1834.79755373 hartree
electener: -3157.52538259 hartree
oneelecener: -5451.42643912 hartree
twoeener: 2293.90105652 hartree
cpcmener: -0.03121012 hartree
kineticenergy: 1318.19704029 hartree
xcener: -106.464110009446 hartree
chargesum: 0.0000000
charge: -0.108952 -0.437082 0.171631 -0.383410 -0.413415 0.436636 0.174207 -0.266727 -0.281668 -0.355586 -0.362615 -0.346208 -0.021290 0.009631 0.042078 -0.223348 -0.228994 0.081112 -0.159813 -0.139526 0.087454 0.122628 0.093999 0.146855 0.142697 0.099936 0.094080 0.099422 0.103668 0.102605 0.101780 0.101598 0.103910 0.096905 0.091483 0.093738 0.220192 0.176138 0.147559 0.140395 0.159182 0.142677 0.144435
qa: -0.1090 -0.4371 0.1716 -0.3834 -0.4134 0.4366 0.1742 -0.2667 -0.2817 -0.3556 -0.3626 -0.3462 -0.0213 0.0096 0.0421 -0.2233 -0.2290 0.0811 -0.1598 -0.1395 0.0875 0.1226 0.0940 0.1469 0.1427 0.0999 0.0941 0.0994 0.1037 0.1026 0.1018 0.1016 0.1039 0.0969 0.0915 0.0937 0.2202 0.1761 0.1476 0.1404 0.1592 0.1427 0.1444
va: 1.1964 2.0118 3.2299 2.7985 3.0268 3.7036 3.7531 3.8326 3.9731 3.9421 3.9433 3.9254 3.6858 3.5763 4.0661 3.9587 4.0060 4.0073 4.0106 3.9622 3.8075 1.0137 1.0214 0.9990 0.9895 1.0037 1.0158 1.0035 0.9961 1.0071 1.0020 1.0071 1.0023 1.0106 1.0244 1.0359 1.0178 0.9940 1.0150 1.0057 0.9941 1.0069 1.0047
dispcorr: -0.024113263 hartree
energy: -1322.751942128162
dipole: -39.50146 36.91755 -2.58391 -5.71650 5.57128 -0.14522 2.49584 -1.47971 1.01613
magnitude: 2.78033 au
magnitude: 7.06703 debye
