program: Orca
programVersion: 4.2.1
elementType: Cl O N N N C C C C C C C C C C C C C C C C H H H H H H H H H H H H H H H H H H H H H H
charge: 0
multiplicity: 1
keywords: wb97x-d3
keywords: def2-TZVPP
keywords: def2/J RIJCOSX GRIDX6 NOFINALGRIDX
keywords: grid4 nofinalgrid
keywords: scfconv7
keywords: smallprint printgap noloewdin
keywords: NOSOSCF
formula: C16H22ClN3O
InChI: InChI=1/C16H22ClN3O/c1-15(2,3)16(21,10-20-12-18-11-19-20)9-8-13-4-6-14(17)7-5-13/h4-7,11-12,21H,8-10H2,1-3H3
43 atoms
Cl 5.231214 2.917956 -1.185845
O  -2.624913 0.695933 1.73723
N  -1.55651 -2.596842 0.61085
N  -0.284653 -2.697089 0.214885
N  -1.455049 -4.48162 -0.473469
C  -2.167675 -0.119839 0.665884
C  -3.232646 -0.097757 -0.490048
C  -0.802733 0.386457 0.175703
C  -2.042767 -1.4806 1.387496
C  -3.60702 1.354315 -0.826187
C  -2.721673 -0.7432 -1.783218
C  -4.523225 -0.80364 -0.063773
C  0.265601 0.548961 1.260151
C  1.518051 1.139417 0.678558
C  -2.234964 -3.666902 0.195842
C  1.787598 2.500759 0.781266
C  2.420944 0.340432 -0.019881
C  -0.275903 -3.834487 -0.431793
C  2.924673 3.057151 0.212485
C  3.56237 0.876212 -0.596239
C  3.804115 2.235887 -0.473228
H  -0.942487 1.355546 -0.313215
H  -0.414066 -0.280081 -0.593585
H  -1.37974 -1.362182 2.243922
H  -3.010158 -1.77703 1.790517
H  -4.128964 1.854078 -0.00882
H  -4.286904 1.363978 -1.679745
H  -2.747713 1.966296 -1.104423
H  -1.877453 -0.202637 -2.211655
H  -3.517336 -0.730278 -2.530954
H  -2.424294 -1.784253 -1.66372
H  -4.41696 -1.886578 0.0042
H  -4.892664 -0.441374 0.896584
H  -5.306265 -0.618685 -0.801575
H  0.503288 -0.419539 1.703195
H  -0.099388 1.188969 2.064807
H  -2.554008 1.619249 1.472082
H  -3.279577 -3.822438 0.412388
H  1.101966 3.145068 1.318087
H  2.232035 -0.722221 -0.115655
H  0.624371 -4.218943 -0.884827
H  3.118622 4.116868 0.307301
H  4.253664 0.239584 -1.131421
elementType: Cl O N C H
totalener: -1322.72843627 hartree
nucrepener: 1833.17307885 hartree
electener: -3155.90151512 hartree
oneelecener: -5447.88143418 hartree
twoeener: 2291.97991905 hartree
cpcmener: -0.02953244 hartree
kineticenergy: 1318.19627739 hartree
xcener: -106.464427604515 hartree
chargesum: -0.0000000
charge: -0.108719 -0.446962 0.162903 -0.382498 -0.413626 0.462231 0.178698 -0.314663 -0.241280 -0.376936 -0.362444 -0.360170 -0.011093 0.000919 0.041464 -0.222603 -0.215548 0.080705 -0.144322 -0.166544 0.091308 0.128560 0.092753 0.146999 0.144371 0.097657 0.096358 0.110938 0.103454 0.101649 0.103728 0.100057 0.101445 0.100574 0.092735 0.092102 0.226247 0.176351 0.140648 0.145093 0.159616 0.144241 0.143605
qa: -0.1087 -0.4470 0.1629 -0.3825 -0.4136 0.4622 0.1787 -0.3147 -0.2413 -0.3769 -0.3624 -0.3602 -0.0111 0.0009 0.0415 -0.2226 -0.2155 0.0807 -0.1443 -0.1665 0.0913 0.1286 0.0928 0.1470 0.1444 0.0977 0.0964 0.1109 0.1035 0.1016 0.1037 0.1001 0.1014 0.1006 0.0927 0.0921 0.2262 0.1764 0.1406 0.1451 0.1596 0.1442 0.1436
va: 1.1967 2.0000 3.2548 2.8061 3.0264 3.6788 3.7386 3.9421 3.8647 3.9321 3.9477 3.9046 3.6620 3.5888 4.0674 4.0001 3.9632 4.0090 3.9683 4.0145 3.8062 1.0081 1.0192 1.0015 0.9938 1.0104 1.0042 1.0012 0.9962 1.0070 1.0005 1.0017 1.0211 1.0064 1.0279 1.0369 1.0106 0.9939 1.0057 1.0131 0.9940 1.0048 1.0068
dispcorr: -0.024120441 hartree
energy: -1322.752556715494
dipole: -38.43108 36.62303 -1.80805 -5.07351 5.98458 0.91108 0.97342 -0.49233 0.48109
magnitude: 2.08100 au
magnitude: 5.28947 debye
