program: Orca
programVersion: 4.2.1
elementType: Cl O N N N C C C C C C C C C C C C C C C C H H H H H H H H H H H H H H H H H H H H H H
charge: 0
multiplicity: 1
keywords: wb97x-d3
keywords: def2-TZVPP
keywords: def2/J RIJCOSX GRIDX6 NOFINALGRIDX
keywords: grid4 nofinalgrid
keywords: scfconv7
keywords: smallprint printgap noloewdin
keywords: NOSOSCF
formula: C16H22ClN3O
InChI: InChI=1/C16H22ClN3O/c1-15(2,3)16(21,10-20-12-18-11-19-20)9-8-13-4-6-14(17)7-5-13/h4-7,11-12,21H,8-10H2,1-3H3
43 atoms
Cl 4.63936 0.805958 -1.514922
O  -2.903121 -1.318419 1.254105
N  -0.310288 -1.703815 -0.073108
N  -0.49483 -2.617897 0.88756
N  1.60795 -2.709113 0.130116
C  -2.269426 -0.262003 0.547294
C  -3.437291 0.554301 -0.116265
C  -1.450969 0.520182 1.601028
C  -1.381817 -0.855167 -0.561485
C  -4.13326 1.438398 0.922628
C  -2.967073 1.44439 -1.273809
C  -4.496208 -0.396027 -0.695877
C  -0.637054 1.767866 1.234264
C  0.667404 1.520892 0.525798
C  0.945683 -1.769515 -0.505778
C  1.716348 0.890022 1.193412
C  0.883431 1.932974 -0.785697
C  0.682519 -3.18525 0.978125
C  2.938176 0.670344 0.57926
C  2.098214 1.716344 -1.423123
C  3.117666 1.08474 -0.731473
H  -0.771328 -0.186933 2.087219
H  -2.151889 0.810251 2.384975
H  -1.990241 -1.441984 -1.251437
H  -0.900913 -0.072681 -1.142677
H  -4.44588 0.872977 1.801821
H  -5.032174 1.878044 0.48594
H  -3.507687 2.266203 1.260304
H  -2.173668 2.136448 -0.998509
H  -3.803898 2.052883 -1.6212
H  -2.623138 0.86818 -2.134011
H  -4.08042 -1.120692 -1.398289
H  -5.032962 -0.947587 0.073662
H  -5.235194 0.187993 -1.248298
H  -0.409806 2.265714 2.18028
H  -1.23487 2.484715 0.673349
H  -2.213804 -1.944082 1.52769
H  1.325325 -1.140623 -1.295634
H  1.5849 0.565233 2.218752
H  0.096957 2.440478 -1.330898
H  0.873924 -3.97824 1.683757
H  3.736955 0.178383 1.116957
H  2.241998 2.043328 -2.443883
elementType: Cl O N C H
totalener: -1322.72552755 hartree
nucrepener: 1933.28310273 hartree
electener: -3256.00863028 hartree
oneelecener: -5647.88189331 hartree
twoeener: 2391.87326303 hartree
cpcmener: -0.02750872 hartree
kineticenergy: 1318.19937857 hartree
xcener: -106.473975926410 hartree
chargesum: -0.0000000
charge: -0.106045 -0.477394 0.164251 -0.397771 -0.406488 0.501982 0.206102 -0.271735 -0.290697 -0.357852 -0.368750 -0.355735 -0.175987 0.022421 0.015892 -0.153687 -0.190828 0.084299 -0.171712 -0.183200 0.115998 0.104548 0.110268 0.159110 0.139359 0.098659 0.099293 0.096983 0.097006 0.104416 0.104980 0.094443 0.094025 0.095532 0.118288 0.116629 0.223471 0.187649 0.139189 0.166105 0.166480 0.138380 0.142122
qa: -0.1060 -0.4774 0.1643 -0.3978 -0.4065 0.5020 0.2061 -0.2717 -0.2907 -0.3579 -0.3687 -0.3557 -0.1760 0.0224 0.0159 -0.1537 -0.1908 0.0843 -0.1717 -0.1832 0.1160 0.1045 0.1103 0.1591 0.1394 0.0987 0.0993 0.0970 0.0970 0.1044 0.1050 0.0944 0.0940 0.0955 0.1183 0.1166 0.2235 0.1876 0.1392 0.1661 0.1665 0.1384 0.1421
va: 1.1980 1.9583 3.2626 2.8672 3.0057 3.5799 3.6314 4.0249 3.9842 3.9233 3.9231 3.9530 3.8379 3.5173 4.0810 3.8833 3.8699 4.0090 3.9566 4.0241 3.7651 1.0162 1.0055 0.9959 0.9756 1.0161 1.0072 1.0007 1.0104 1.0092 0.9946 1.0083 1.0147 1.0027 0.9987 0.9895 1.0658 0.9854 1.0044 0.9858 0.9920 1.0100 1.0092
dispcorr: -0.027622890 hartree
energy: -1322.753150437665
dipole: -39.83307 38.95917 -0.87390 8.17964 -6.67063 1.50901 4.51725 -4.96769 -0.45044
magnitude: 1.80103 au
magnitude: 4.57786 debye
