program: Orca
programVersion: 4.2.1
elementType: Cl O N N N C C C C C C C C C C C C C C C C H H H H H H H H H H H H H H H H H H H H H H
charge: 0
multiplicity: 1
keywords: wb97x-d3
keywords: def2-TZVPP
keywords: def2/J RIJCOSX GRIDX6 NOFINALGRIDX
keywords: grid4 nofinalgrid
keywords: scfconv7
keywords: smallprint printgap noloewdin
keywords: NOSOSCF
formula: C16H22ClN3O
InChI: InChI=1/C16H22ClN3O/c1-15(2,3)16(21,10-20-12-18-11-19-20)9-8-13-4-6-14(17)7-5-13/h4-7,11-12,21H,8-10H2,1-3H3
43 atoms
Cl 4.901604 4.530135 0.067625
O  -1.012681 -1.40205 1.547202
N  -2.001934 -3.049789 -0.622886
N  -2.962101 -3.302447 -1.516932
N  -2.991279 -4.84202 0.113047
C  -1.315331 -0.792193 0.304589
C  -2.755174 -0.158243 0.333285
C  -0.255068 0.29157 0.006784
C  -1.12706 -1.902583 -0.739421
C  -2.75407 1.121545 1.185121
C  -3.2301 0.215481 -1.073463
C  -3.797047 -1.097546 0.958362
C  1.187571 -0.203802 -0.153094
C  2.14533 0.952694 -0.106795
C  -2.032915 -3.972902 0.337069
C  2.634491 1.4210 1.110341
C  2.526553 1.618028 -1.268392
C  -3.525225 -4.379716 -1.031446
C  3.480956 2.517176 1.174872
C  3.371891 2.71767 -1.226016
C  3.84223 3.158159 0.000279
H  -0.266826 1.003601 0.835089
H  -0.531986 0.861801 -0.883205
H  -1.249119 -1.508212 -1.745301
H  -0.107393 -2.279698 -0.668596
H  -2.367354 0.964005 2.195582
H  -3.777761 1.480827 1.300146
H  -2.183828 1.932969 0.733687
H  -2.533219 0.87587 -1.591931
H  -4.1830 0.744773 -1.011237
H  -3.393465 -0.660361 -1.701399
H  -4.020319 -1.967529 0.344909
H  -3.508052 -1.444212 1.949914
H  -4.73879 -0.556168 1.070759
H  1.314775 -0.732769 -1.099101
H  1.430297 -0.908863 0.644671
H  -1.110456 -0.747083 2.247253
H  -1.342891 -3.989665 1.163631
H  2.354952 0.920844 2.029903
H  2.1616 1.275258 -2.229079
H  -4.35449 -4.855466 -1.53102
H  3.853891 2.862338 2.12957
H  3.657813 3.220456 -2.139846
elementType: Cl O N C H
totalener: -1322.72846883 hartree
nucrepener: 1801.17367920 hartree
electener: -3123.90214803 hartree
oneelecener: -5383.48061716 hartree
twoeener: 2259.57846913 hartree
cpcmener: -0.03072672 hartree
kineticenergy: 1318.19583351 hartree
xcener: -106.464214407252 hartree
chargesum: -0.0000000
charge: -0.108204 -0.445585 0.130919 -0.370976 -0.413811 0.495478 0.188090 -0.324217 -0.246197 -0.351009 -0.368188 -0.348856 0.004718 -0.021497 0.071347 -0.230742 -0.203579 0.062978 -0.153184 -0.162932 0.097485 0.105652 0.108064 0.133763 0.161063 0.094528 0.099123 0.099541 0.105638 0.102524 0.093119 0.092741 0.098014 0.103498 0.081168 0.098933 0.218956 0.164263 0.143095 0.144083 0.160126 0.144916 0.145152
qa: -0.1082 -0.4456 0.1309 -0.3710 -0.4138 0.4955 0.1881 -0.3242 -0.2462 -0.3510 -0.3682 -0.3489 0.0047 -0.0215 0.0713 -0.2307 -0.2036 0.0630 -0.1532 -0.1629 0.0975 0.1057 0.1081 0.1338 0.1611 0.0945 0.0991 0.0995 0.1056 0.1025 0.0931 0.0927 0.0980 0.1035 0.0812 0.0989 0.2190 0.1643 0.1431 0.1441 0.1601 0.1449 0.1452
va: 1.1970 1.9794 3.3325 2.8385 3.0313 3.5904 3.7827 3.9629 3.8710 3.9307 3.9285 3.9109 3.6886 3.6155 4.0603 3.9828 3.9701 4.0289 3.9763 3.9864 3.8051 0.9975 1.0125 0.9997 0.9865 1.0094 1.0086 0.9972 1.0050 1.0041 1.0199 1.0080 1.0211 1.0102 1.0171 1.0289 1.0210 1.0152 1.0057 1.0035 0.9962 1.0048 1.0054
dispcorr: -0.023355067 hartree
energy: -1322.751823895747
dipole: -30.10705 30.39480 0.28775 -9.19795 10.38876 1.19082 1.92902 -1.67119 0.25783
magnitude: 1.25193 au
magnitude: 3.18214 debye
