program: Orca
programVersion: 4.2.1
elementType: Cl O N N N C C C C C C C C C C C C C C C C H H H H H H H H H H H H H H H H H H H H H H
charge: 0
multiplicity: 1
keywords: wb97x-d3
keywords: def2-TZVPP
keywords: def2/J RIJCOSX GRIDX6 NOFINALGRIDX
keywords: grid4 nofinalgrid
keywords: scfconv7
keywords: smallprint printgap noloewdin
keywords: NOSOSCF
formula: C16H22ClN3O
InChI: InChI=1/C16H22ClN3O/c1-15(2,3)16(21,10-20-12-18-11-19-20)9-8-13-4-6-14(17)7-5-13/h4-7,11-12,21H,8-10H2,1-3H3
43 atoms
Cl 4.26375 4.03884 0.208243
O  -1.328854 -0.499062 1.499431
N  -1.518299 -2.986684 -0.097471
N  -0.802846 -3.326246 0.979459
N  -0.173817 -4.546644 -0.782793
C  -1.904158 -0.545288 0.211038
C  -3.045101 0.526946 0.204592
C  -0.862388 -0.246417 -0.900612
C  -2.516122 -1.943918 -0.021139
C  -4.189678 0.126109 1.14477
C  -2.501856 1.874739 0.694853
C  -3.626015 0.718135 -1.200352
C  0.59951 -0.675083 -0.643228
C  1.525083 0.490784 -0.412488
C  -1.130406 -3.720126 -1.140556
C  1.393941 1.312219 0.707168
C  2.527007 0.793435 -1.329542
C  -0.007592 -4.263477 0.520315
C  2.229897 2.399849 0.904657
C  3.374993 1.878103 -1.149398
C  3.216644 2.675995 -0.029706
H  -0.85816 0.823157 -1.110435
H  -1.205213 -0.707869 -1.829866
H  -3.197165 -2.207922 0.78692
H  -3.077062 -1.975508 -0.952895
H  -4.8863 0.95986 1.251062
H  -3.83105 -0.126659 2.143055
H  -4.772936 -0.716497 0.769609
H  -3.283229 2.633501 0.614873
H  -1.652723 2.233518 0.111025
H  -2.193744 1.837257 1.739636
H  -4.030614 -0.204305 -1.621733
H  -4.452429 1.430687 -1.161624
H  -2.89964 1.115513 -1.909817
H  0.962203 -1.232414 -1.507435
H  0.6856 -1.360233 0.20043
H  -0.879162 -1.335511 1.685244
H  -1.570474 -3.625869 -2.120794
H  0.624593 1.103757 1.439292
H  2.654551 0.173998 -2.20931
H  0.711234 -4.760399 1.152731
H  2.110571 3.024771 1.779782
H  4.145225 2.093665 -1.877832
elementType: Cl O N C H
totalener: -1322.73606131 hartree
nucrepener: 1853.30335655 hartree
electener: -3176.03941786 hartree
oneelecener: -5488.16184537 hartree
twoeener: 2312.12242750 hartree
cpcmener: -0.02364077 hartree
kineticenergy: 1318.16036928 hartree
xcener: -106.459312179677 hartree
chargesum: 0.0000000
charge: -0.107573 -0.431611 0.126944 -0.394471 -0.401019 0.411683 0.239265 -0.293748 -0.208086 -0.373487 -0.360664 -0.353512 -0.067902 0.061321 0.064807 -0.287583 -0.218777 0.083142 -0.140451 -0.139147 0.087105 0.111486 0.115510 0.143624 0.122667 0.097925 0.103872 0.094625 0.101366 0.092893 0.101289 0.097802 0.100822 0.099401 0.097207 0.094671 0.216383 0.175385 0.155841 0.135170 0.163551 0.141097 0.141178
qa: -0.1076 -0.4316 0.1269 -0.3945 -0.4010 0.4117 0.2393 -0.2937 -0.2081 -0.3735 -0.3607 -0.3535 -0.0679 0.0613 0.0648 -0.2876 -0.2188 0.0831 -0.1405 -0.1391 0.0871 0.1115 0.1155 0.1436 0.1227 0.0979 0.1039 0.0946 0.1014 0.0929 0.1013 0.0978 0.1008 0.0994 0.0972 0.0947 0.2164 0.1754 0.1558 0.1352 0.1636 0.1411 0.1412
va: 1.1981 1.9988 3.3326 2.8364 3.0316 3.6195 3.7176 3.8812 3.9402 3.9257 3.9239 3.9336 3.7237 3.5467 4.0422 3.9749 4.0245 4.0152 4.0056 3.9738 3.8194 1.0034 1.0017 0.9944 1.0002 1.0056 1.0206 0.9972 1.0083 1.0058 1.0122 1.0064 1.0047 1.0014 1.0116 1.0304 1.0590 0.9929 1.0259 1.0070 0.9944 1.0076 1.0061
dispcorr: -0.024679134 hartree
energy: -1322.760740446659
dipole: -35.04116 33.10266 -1.93850 -6.20446 5.70647 -0.49799 -2.77326 1.64651 -1.12675
magnitude: 2.29681 au
magnitude: 5.83803 debye
