program: Orca
programVersion: 4.2.1
elementType: Cl O N N N C C C C C C C C C C C C C C C C H H H H H H H H H H H H H H H H H H H H H H
charge: 0
multiplicity: 1
keywords: wb97x-d3
keywords: def2-TZVPP
keywords: def2/J RIJCOSX GRIDX6 NOFINALGRIDX
keywords: grid4 nofinalgrid
keywords: scfconv7
keywords: smallprint printgap noloewdin
keywords: NOSOSCF
formula: C16H22ClN3O
InChI: InChI=1/C16H22ClN3O/c1-15(2,3)16(21,10-20-12-18-11-19-20)9-8-13-4-6-14(17)7-5-13/h4-7,11-12,21H,8-10H2,1-3H3
43 atoms
Cl 4.85022 4.444307 -1.175751
O  -1.283395 -0.774082 1.816113
N  -1.85946 -3.157745 0.146836
N  -2.043877 -3.467942 1.432151
N  -3.142618 -4.907528 0.127228
C  -1.389748 -0.685042 0.410302
C  -2.819194 -0.157212 0.007044
C  -0.300555 0.313002 -0.03071
C  -1.021414 -2.040555 -0.2319
C  -3.949348 -0.977011 0.647818
C  -2.996656 1.288973 0.495444
C  -3.027741 -0.176573 -1.510017
C  1.140669 -0.049127 0.350269
C  2.083993 1.061769 -0.016677
C  -2.515394 -4.026886 -0.620585
C  2.172246 2.214096 0.762049
C  2.868816 0.984137 -1.163124
C  -2.825047 -4.519315 1.374371
C  3.016339 3.257025 0.414417
C  3.721715 2.015886 -1.528317
C  3.7870 3.147635 -0.733086
H  -0.521209 1.279563 0.425093
H  -0.353333 0.467988 -1.111204
H  -1.038841 -1.973588 -1.318011
H  -0.004169 -2.306966 0.053675
H  -4.90253 -0.480916 0.453899
H  -3.85409 -1.054751 1.73121
H  -4.047581 -1.981126 0.238084
H  -4.043569 1.584371 0.400575
H  -2.418161 2.00766 -0.086929
H  -2.722982 1.405499 1.545609
H  -2.26213 0.382902 -2.050318
H  -3.054157 -1.18762 -1.92164
H  -3.987323 0.282788 -1.757325
H  1.470273 -0.958097 -0.155688
H  1.198384 -0.245355 1.422775
H  -1.646645 -1.622538 2.110358
H  -2.508327 -3.98457 -1.69854
H  1.575808 2.302944 1.662589
H  2.821666 0.099173 -1.786662
H  -3.171545 -5.023058 2.263212
H  3.073746 4.141955 1.034016
H  4.327086 1.93198 -2.420893
elementType: Cl O N C H
totalener: -1322.73951033 hartree
nucrepener: 1800.34915142 hartree
electener: -3123.08866174 hartree
oneelecener: -5382.06411655 hartree
twoeener: 2258.97545480 hartree
cpcmener: -0.02536126 hartree
kineticenergy: 1318.16223956 hartree
xcener: -106.461264918607 hartree
chargesum: 0.0000000
charge: -0.105609 -0.462750 0.141445 -0.375590 -0.405216 0.518373 0.230390 -0.311565 -0.295160 -0.378050 -0.368721 -0.372791 -0.022375 -0.008770 0.056015 -0.231261 -0.197371 0.083027 -0.149242 -0.150166 0.090484 0.110404 0.108442 0.132038 0.166083 0.099958 0.101436 0.098770 0.096911 0.095374 0.104562 0.107317 0.090439 0.103532 0.073160 0.106007 0.220914 0.171491 0.142478 0.137905 0.163151 0.142573 0.141963
qa: -0.1056 -0.4627 0.1414 -0.3756 -0.4052 0.5184 0.2304 -0.3116 -0.2952 -0.3781 -0.3687 -0.3728 -0.0224 -0.0088 0.0560 -0.2313 -0.1974 0.0830 -0.1492 -0.1502 0.0905 0.1104 0.1084 0.1320 0.1661 0.1000 0.1014 0.0988 0.0969 0.0954 0.1046 0.1073 0.0904 0.1035 0.0732 0.1060 0.2209 0.1715 0.1425 0.1379 0.1632 0.1426 0.1420
va: 1.2001 1.9789 3.3106 2.8517 3.0271 3.5577 3.7215 3.8830 3.9896 3.9334 3.9112 3.9586 3.7183 3.6132 4.0518 3.9892 3.9664 4.0114 3.9823 3.9833 3.8241 1.0035 1.0117 0.9854 0.9826 1.0112 1.0173 0.9960 1.0086 0.9949 1.0210 1.0025 1.0011 1.0035 1.0272 1.0272 1.0658 0.9951 1.0045 1.0047 0.9940 1.0056 1.0061
dispcorr: -0.023194881 hartree
energy: -1322.762705208557
dipole: -31.13725 30.81018 -0.32707 -10.57220 10.23845 -0.33375 1.09667 -2.24491 -1.14824
magnitude: 1.23968 au
magnitude: 3.15101 debye
