program: Orca
programVersion: 4.2.1
elementType: Cl O N N N C C C C C C C C C C C C C C C C H H H H H H H H H H H H H H H H H H H H H H
charge: 0
multiplicity: 1
keywords: wb97x-d3
keywords: def2-TZVPP
keywords: def2/J RIJCOSX GRIDX6 NOFINALGRIDX
keywords: grid4 nofinalgrid
keywords: scfconv7
keywords: smallprint printgap noloewdin
keywords: NOSOSCF
formula: C16H22ClN3O
InChI: InChI=1/C16H22ClN3O/c1-15(2,3)16(21,10-20-12-18-11-19-20)9-8-13-4-6-14(17)7-5-13/h4-7,11-12,21H,8-10H2,1-3H3
43 atoms
Cl 4.137645 3.521812 1.177008
O  -0.698047 -0.528582 1.165041
N  -1.364009 -2.902502 -0.275112
N  -1.292001 -3.309519 -1.544505
N  0.247043 -4.356942 -0.302953
C  -1.675973 -0.464645 0.146762
C  -2.776839 0.588443 0.523713
C  -1.052816 -0.147954 -1.237788
C  -2.289165 -1.873657 0.144143
C  -3.521594 0.176584 1.799154
C  -2.123766 1.949893 0.79529
C  -3.801485 0.758261 -0.602222
C  0.436581 -0.473808 -1.414868
C  1.367449 0.51695 -0.763927
C  -0.440459 -3.532359 0.453133
C  2.236215 0.138172 0.256684
C  1.386538 1.849351 -1.174879
C  -0.314492 -4.180434 -1.514673
C  3.091156 1.051552 0.85792
C  2.232397 2.776999 -0.588179
C  3.078716 2.368355 0.430863
H  -1.186312 0.90815 -1.47791
H  -1.616754 -0.678796 -2.007185
H  -2.629523 -2.137584 1.144545
H  -3.147661 -1.930776 -0.521356
H  -4.146652 1.001601 2.14651
H  -2.837639 -0.073143 2.611492
H  -4.188415 -0.673451 1.644868
H  -1.517261 2.31375 -0.036276
H  -1.49687 1.943588 1.689264
H  -2.897453 2.700123 0.968563
H  -4.571259 1.469605 -0.2959
H  -3.359662 1.14621 -1.520742
H  -4.315276 -0.172168 -0.850315
H  0.638016 -0.477568 -2.489313
H  0.678964 -1.475899 -1.064211
H  -0.178951 0.281646 1.174142
H  -0.312939 -3.369545 1.511272
H  2.251573 -0.890574 0.595811
H  0.734555 2.178128 -1.975822
H  0.001217 -4.712332 -2.398953
H  3.75365 0.734157 1.651977
H  2.230544 3.804749 -0.925663
elementType: Cl O N C H
totalener: -1322.73714953 hartree
nucrepener: 1883.76990098 hartree
electener: -3206.50705051 hartree
oneelecener: -5548.98067248 hartree
twoeener: 2342.47362198 hartree
cpcmener: -0.02290370 hartree
kineticenergy: 1318.17557327 hartree
xcener: -106.461745387276 hartree
chargesum: -0.0000000
charge: -0.103886 -0.421843 0.119566 -0.355728 -0.409265 0.448460 0.194973 -0.277912 -0.223126 -0.365033 -0.379835 -0.346953 -0.067653 0.004166 0.060628 -0.198192 -0.259236 0.055704 -0.138748 -0.129318 0.088480 0.111160 0.112464 0.139354 0.128002 0.098961 0.102058 0.093917 0.105949 0.101051 0.101819 0.100060 0.099821 0.099535 0.114146 0.081301 0.216729 0.163717 0.143836 0.143976 0.159578 0.143556 0.143767
qa: -0.1039 -0.4218 0.1196 -0.3557 -0.4093 0.4485 0.1950 -0.2779 -0.2231 -0.3650 -0.3798 -0.3470 -0.0677 0.0042 0.0606 -0.1982 -0.2592 0.0557 -0.1387 -0.1293 0.0885 0.1112 0.1125 0.1394 0.1280 0.0990 0.1021 0.0939 0.1059 0.1011 0.1018 0.1001 0.0998 0.0995 0.1141 0.0813 0.2167 0.1637 0.1438 0.1440 0.1596 0.1436 0.1438
va: 1.2013 2.0199 3.3556 2.8625 3.0169 3.5851 3.8157 3.8733 3.8912 3.9104 3.9146 3.9375 3.8313 3.5501 4.0531 3.9179 3.9853 4.0400 4.0055 3.9655 3.8309 1.0053 1.0202 0.9953 1.0174 1.0056 1.0225 0.9972 1.0032 1.0064 1.0090 1.0049 1.0016 1.0055 1.0032 1.0145 1.0345 1.0082 1.0042 1.0027 0.9969 1.0051 1.0041
dispcorr: -0.025578604 hartree
energy: -1322.762728131821
dipole: -33.42162 31.76584 -1.65578 -2.28560 3.41591 1.13031 -2.44544 2.44469 -0.00075
magnitude: 2.00480 au
magnitude: 5.09579 debye
