program: Orca
programVersion: 4.2.1
elementType: Cl O N N N C C C C C C C C C C C C C C C C H H H H H H H H H H H H H H H H H H H H H H
charge: 0
multiplicity: 1
keywords: wb97x-d3
keywords: def2-TZVPP
keywords: def2/J RIJCOSX GRIDX6 NOFINALGRIDX
keywords: grid4 nofinalgrid
keywords: scfconv7
keywords: smallprint printgap noloewdin
keywords: NOSOSCF
formula: C16H22ClN3O
InChI: InChI=1/C16H22ClN3O/c1-15(2,3)16(21,10-20-12-18-11-19-20)9-8-13-4-6-14(17)7-5-13/h4-7,11-12,21H,8-10H2,1-3H3
43 atoms
Cl 5.441031 1.731803 -0.757965
O  -2.243801 -0.244304 1.661199
N  -1.216549 -2.519591 0.12118
N  -0.699879 -2.526214 1.353753
N  0.565464 -3.752878 -0.01591
C  -2.357572 -0.294901 0.256627
C  -3.715283 0.399992 -0.097616
C  -1.12191 0.353828 -0.424079
C  -2.418354 -1.773901 -0.199898
C  -3.625607 1.91208 0.128981
C  -4.107766 0.166559 -1.560263
C  -4.850122 -0.129709 0.789532
C  -0.494283 1.574081 0.27042
C  0.986268 1.641966 0.01638
C  -0.447937 -3.250959 -0.684841
C  1.53053 2.509232 -0.924826
C  1.854654 0.799986 0.710385
C  0.368457 -3.275404 1.223903
C  2.897063 2.544248 -1.171105
C  3.220353 0.818832 0.481065
C  3.731669 1.696136 -0.463662
H  -1.353533 0.599224 -1.463302
H  -0.338496 -0.405219 -0.488979
H  -3.266558 -2.283627 0.258055
H  -2.53081 -1.843401 -1.27992
H  -2.995693 2.404855 -0.612238
H  -3.249151 2.164463 1.120743
H  -4.619704 2.355992 0.039152
H  -4.396856 -0.866201 -1.763216
H  -3.314549 0.436198 -2.260207
H  -4.972171 0.784736 -1.810915
H  -4.976069 -1.212114 0.728775
H  -4.711603 0.12947 1.838407
H  -5.796548 0.311443 0.469015
H  -0.665856 1.515573 1.346107
H  -0.958711 2.499813 -0.067092
H  -1.557002 -0.869366 1.942341
H  -0.662985 -3.38947 -1.732762
H  0.882679 3.176895 -1.480169
H  1.459417 0.114444 1.4515
H  1.02373 -3.481762 2.055707
H  3.300158 3.227891 -1.906293
H  3.875292 0.159796 1.035114
elementType: Cl O N C H
totalener: -1322.73761853 hartree
nucrepener: 1842.32638077 hartree
electener: -3165.06399929 hartree
oneelecener: -5466.28715032 hartree
twoeener: 2301.22315103 hartree
cpcmener: -0.02496960 hartree
kineticenergy: 1318.16972183 hartree
xcener: -106.461765427036 hartree
chargesum: -0.0000000
charge: -0.106525 -0.450832 0.115335 -0.380600 -0.403099 0.424651 0.248732 -0.310002 -0.200444 -0.387228 -0.375688 -0.353947 -0.036316 0.019789 0.073218 -0.195592 -0.234212 0.081547 -0.155875 -0.159956 0.099187 0.113282 0.107068 0.149696 0.120524 0.099187 0.105111 0.102464 0.097098 0.106364 0.100674 0.092456 0.099169 0.096748 0.105835 0.082041 0.215083 0.172589 0.137808 0.136624 0.165187 0.141010 0.141842
qa: -0.1065 -0.4508 0.1153 -0.3806 -0.4031 0.4247 0.2487 -0.3100 -0.2004 -0.3872 -0.3757 -0.3539 -0.0363 0.0198 0.0732 -0.1956 -0.2342 0.0815 -0.1559 -0.1600 0.0992 0.1133 0.1071 0.1497 0.1205 0.0992 0.1051 0.1025 0.0971 0.1064 0.1007 0.0925 0.0992 0.0967 0.1058 0.0820 0.2151 0.1726 0.1378 0.1366 0.1652 0.1410 0.1418
va: 1.1987 1.9877 3.3547 2.8507 3.0287 3.6572 3.6618 3.9143 3.9673 3.9387 3.9472 3.9418 3.6590 3.5963 4.0470 3.9806 3.9789 4.0069 3.9868 4.0037 3.8162 1.0194 0.9999 0.9890 0.9916 0.9979 1.0082 1.0094 0.9971 1.0040 1.0039 1.0071 1.0154 1.0026 1.0325 1.0160 1.0755 0.9931 1.0051 1.0157 0.9934 1.0064 1.0064
dispcorr: -0.023633844 hartree
energy: -1322.761252370128
dipole: -44.40784 42.45169 -1.95615 2.29718 -2.26930 0.02788 -1.22849 0.04396 -1.18453
magnitude: 2.28701 au
magnitude: 5.81311 debye
