program: Orca
programVersion: 4.2.1
elementType: Cl O N N N C C C C C C C C C C C C C C C C H H H H H H H H H H H H H H H H H H H H H H
charge: 0
multiplicity: 1
keywords: wb97x-d3
keywords: def2-TZVPP
keywords: def2/J RIJCOSX GRIDX6 NOFINALGRIDX
keywords: grid4 nofinalgrid
keywords: scfconv7
keywords: smallprint printgap noloewdin
keywords: NOSOSCF
formula: C16H22ClN3O
InChI: InChI=1/C16H22ClN3O/c1-15(2,3)16(21,10-20-12-18-11-19-20)9-8-13-4-6-14(17)7-5-13/h4-7,11-12,21H,8-10H2,1-3H3
43 atoms
Cl 5.37055 2.25557 -0.104214
O  -2.621416 -0.48763 1.877444
N  -1.164144 -2.435728 0.154934
N  -0.837229 -2.646532 1.432987
N  0.629704 -3.656597 0.087482
C  -2.3878 -0.286276 0.49397
C  -3.630805 0.518184 -0.015903
C  -1.032277 0.450321 0.365676
C  -2.336644 -1.662834 -0.204526
C  -3.503275 0.954675 -1.478092
C  -4.906523 -0.329069 0.107903
C  -3.830054 1.78007 0.831799
C  -0.336427 0.549057 -1.000064
C  1.0958 0.972146 -0.820829
C  -0.283281 -3.04823 -0.635758
C  1.44596 2.319383 -0.809736
C  2.100242 0.031369 -0.606416
C  0.246636 -3.378216 1.345851
C  2.754788 2.724075 -0.5909
C  3.414556 0.414472 -0.387366
C  3.730703 1.7637 -0.379533
H  -0.337993 -0.052729 1.04519
H  -1.138144 1.456796 0.777177
H  -3.214832 -2.248788 0.06542
H  -2.329481 -1.570154 -1.288909
H  -3.249345 0.138151 -2.156829
H  -2.770737 1.748658 -1.618044
H  -4.460216 1.355857 -1.818913
H  -5.780554 0.296034 -0.085961
H  -5.027891 -0.755063 1.104072
H  -4.945271 -1.144996 -0.616276
H  -4.04415 1.55281 1.875772
H  -2.967629 2.448036 0.803022
H  -4.679074 2.347633 0.443907
H  -0.839518 1.266786 -1.645536
H  -0.363385 -0.405397 -1.528715
H  -1.979995 -1.137005 2.202038
H  -0.343799 -3.026994 -1.712943
H  0.686684 3.074265 -0.977012
H  1.864079 -1.026453 -0.612651
H  0.776512 -3.72044 2.221039
H  3.006401 3.77622 -0.587231
H  4.179659 -0.333145 -0.226168
elementType: Cl O N C H
totalener: -1322.73810441 hartree
nucrepener: 1851.30635375 hartree
electener: -3174.04445815 hartree
oneelecener: -5483.97485491 hartree
twoeener: 2309.93039676 hartree
cpcmener: -0.02527456 hartree
kineticenergy: 1318.16406369 hartree
xcener: -106.461033397783 hartree
chargesum: -0.0000000
charge: -0.104293 -0.454937 0.156860 -0.390095 -0.410898 0.512747 0.261329 -0.389650 -0.249242 -0.389175 -0.371029 -0.370747 -0.076010 0.024129 0.029837 -0.218690 -0.206177 0.086672 -0.145145 -0.158573 0.095438 0.111938 0.120056 0.149151 0.127021 0.104345 0.102823 0.104202 0.097003 0.103189 0.098038 0.101433 0.095494 0.099170 0.108052 0.104606 0.218705 0.181155 0.140790 0.154076 0.164796 0.141993 0.139613
qa: -0.1043 -0.4549 0.1569 -0.3901 -0.4109 0.5127 0.2613 -0.3896 -0.2492 -0.3892 -0.3710 -0.3707 -0.0760 0.0241 0.0298 -0.2187 -0.2062 0.0867 -0.1451 -0.1586 0.0954 0.1119 0.1201 0.1492 0.1270 0.1043 0.1028 0.1042 0.0970 0.1032 0.0980 0.1014 0.0955 0.0992 0.1081 0.1046 0.2187 0.1812 0.1408 0.1541 0.1648 0.1420 0.1396
va: 1.2009 1.9876 3.2710 2.8572 2.9932 3.5674 3.6267 4.0074 3.9699 3.9498 3.9179 3.9329 3.6632 3.6055 4.0337 4.0096 3.9411 4.0059 3.9793 4.0404 3.8189 1.0246 1.0109 0.9892 0.9953 1.0032 1.0005 1.0066 1.0058 1.0236 0.9952 1.0168 1.0028 1.0021 1.0185 1.0112 1.0628 0.9893 1.0040 1.0064 0.9929 1.0055 1.0094
dispcorr: -0.024491918 hartree
energy: -1322.762596325123
dipole: -42.95480 41.34501 -1.60979 0.76105 -0.68631 0.07473 -3.89183 2.39899 -1.49284
magnitude: 2.19672 au
magnitude: 5.58363 debye
