program: Orca
programVersion: 4.2.1
elementType: Cl O N N N C C C C C C C C C C C C C C C C H H H H H H H H H H H H H H H H H H H H H H
charge: 0
multiplicity: 1
keywords: wb97x-d3
keywords: def2-TZVPP
keywords: def2/J RIJCOSX GRIDX6 NOFINALGRIDX
keywords: grid4 nofinalgrid
keywords: scfconv7
keywords: smallprint printgap noloewdin
keywords: NOSOSCF
formula: C16H22ClN3O
InChI: InChI=1/C16H22ClN3O/c1-15(2,3)16(21,10-20-12-18-11-19-20)9-8-13-4-6-14(17)7-5-13/h4-7,11-12,21H,8-10H2,1-3H3
43 atoms
Cl 5.06553 2.910552 -0.795586
O  -2.489203 -0.833189 1.689951
N  -1.30016 -2.514132 -0.337999
N  -0.286811 -2.466028 -1.205493
N  0.147897 -3.944729 0.416759
C  -2.406874 -0.380968 0.352153
C  -3.649009 0.515052 0.008917
C  -1.083797 0.381939 0.087446
C  -2.464744 -1.669982 -0.480714
C  -3.783248 1.638963 1.044622
C  -3.515779 1.150026 -1.37896
C  -4.947485 -0.300096 0.046246
C  0.081094 0.060215 1.03191
C  1.333764 0.765787 0.591374
C  -1.027848 -3.398277 0.6240
C  2.368842 0.073916 -0.029263
C  1.480379 2.14006 0.770729
C  0.55758 -3.339548 -0.715128
C  3.519339 0.721323 -0.456678
C  2.618643 2.807405 0.346395
C  3.632986 2.087921 -0.26626
H  -1.256781 1.458392 0.150387
H  -0.767246 0.204117 -0.942831
H  -3.329145 -2.26485 -0.188719
H  -2.562789 -1.447739 -1.540885
H  -2.877121 2.238505 1.152871
H  -4.06094 1.266537 2.032606
H  -4.575767 2.325237 0.741142
H  -2.691026 1.860832 -1.440345
H  -4.427346 1.700194 -1.62133
H  -3.375229 0.412479 -2.17116
H  -5.041203 -0.88431 0.962985
H  -5.807575 0.370975 0.002232
H  -5.042987 -0.981417 -0.800869
H  0.275307 -1.009987 1.090393
H  -0.163949 0.380807 2.047356
H  -2.381336 -0.088414 2.290315
H  -1.704472 -3.612632 1.435478
H  2.285505 -0.995167 -0.179489
H  0.695888 2.708196 1.256982
H  1.500353 -3.551635 -1.195524
H  4.314347 0.161392 -0.930512
H  2.712739 3.874374 0.49731
elementType: Cl O N C H
totalener: -1322.73894930 hartree
nucrepener: 1845.85814818 hartree
electener: -3168.59709748 hartree
oneelecener: -5473.34308910 hartree
twoeener: 2304.74599162 hartree
cpcmener: -0.02646863 hartree
kineticenergy: 1318.16881854 hartree
xcener: -106.458490594129 hartree
chargesum: 0.0000000
charge: -0.106322 -0.418103 0.118920 -0.341785 -0.406020 0.490522 0.184198 -0.370122 -0.208635 -0.367495 -0.345738 -0.363251 -0.047120 0.005029 0.059338 -0.194250 -0.221101 0.034369 -0.162856 -0.154594 0.099157 0.111183 0.114683 0.138378 0.128338 0.112381 0.096603 0.097944 0.097083 0.100282 0.100828 0.100388 0.099334 0.096149 0.093244 0.100691 0.210196 0.164910 0.164289 0.140779 0.166892 0.139358 0.141927
qa: -0.1063 -0.4181 0.1189 -0.3418 -0.4060 0.4905 0.1842 -0.3701 -0.2086 -0.3675 -0.3457 -0.3633 -0.0471 0.0050 0.0593 -0.1943 -0.2211 0.0344 -0.1629 -0.1546 0.0992 0.1112 0.1147 0.1384 0.1283 0.1124 0.0966 0.0979 0.0971 0.1003 0.1008 0.1004 0.0993 0.0961 0.0932 0.1007 0.2102 0.1649 0.1643 0.1408 0.1669 0.1394 0.1419
va: 1.1988 2.0132 3.3603 2.8561 3.0226 3.5443 3.8267 3.9195 3.8874 3.9253 3.9389 3.9089 3.7336 3.6220 4.0585 3.9522 4.0046 4.0501 4.0324 3.9932 3.8137 1.0084 1.0185 0.9950 1.0172 0.9992 1.0087 1.0053 1.0019 1.0039 1.0059 1.0221 1.0048 0.9962 1.0134 1.0208 1.0267 1.0077 0.9884 1.0030 0.9943 1.0095 1.0062
dispcorr: -0.024314771 hartree
energy: -1322.763264073926
dipole: -42.35003 39.88351 -2.46653 -0.60498 1.67443 1.06945 3.27881 -2.84331 0.43551
magnitude: 2.72344 au
magnitude: 6.92244 debye
