program: Orca
programVersion: 4.2.1
elementType: Cl O N N N C C C C C C C C C C C C C C C C H H H H H H H H H H H H H H H H H H H H H H
charge: 0
multiplicity: 1
keywords: wb97x-d3
keywords: def2-TZVPP
keywords: def2/J RIJCOSX GRIDX6 NOFINALGRIDX
keywords: grid4 nofinalgrid
keywords: scfconv7
keywords: smallprint printgap noloewdin
keywords: NOSOSCF
formula: C16H22ClN3O
InChI: InChI=1/C16H22ClN3O/c1-15(2,3)16(21,10-20-12-18-11-19-20)9-8-13-4-6-14(17)7-5-13/h4-7,11-12,21H,8-10H2,1-3H3
43 atoms
Cl 5.039544 2.871097 -1.165152
O  -2.416454 -0.490657 1.72057
N  -1.312938 -2.619496 0.063349
N  -0.249086 -2.756263 -0.731717
N  0.034693 -3.9260 1.154605
C  -2.369235 -0.368426 0.313688
C  -3.579493 0.486413 -0.205541
C  -1.025646 0.308007 -0.038079
C  -2.435241 -1.783111 -0.297342
C  -3.667209 1.799471 0.580514
C  -3.431525 0.815082 -1.693877
C  -4.912556 -0.251633 -0.018389
C  0.106663 0.161211 0.985076
C  1.352315 0.828382 0.471103
C  -1.130729 -3.321811 1.18286
C  1.58945 2.179489 0.711295
C  2.279134 0.127102 -0.295516
C  0.53129 -3.548807 -0.038955
C  2.71585 2.816739 0.212072
C  3.414091 0.743604 -0.800569
C  3.622415 2.088688 -0.540998
H  -1.177987 1.378922 -0.182378
H  -0.681505 -0.063896 -1.006303
H  -3.335671 -2.29961 0.035382
H  -2.466981 -1.747791 -1.384337
H  -3.845533 1.636596 1.643234
H  -4.497664 2.398766 0.20303
H  -2.769699 2.411751 0.487514
H  -4.289185 1.401207 -2.029881
H  -3.394128 -0.076149 -2.322254
H  -2.541771 1.407339 -1.90632
H  -5.739089 0.413206 -0.27399
H  -5.00853 -1.127741 -0.659359
H  -5.09131 -0.572411 1.010491
H  0.323287 -0.883823 1.208011
H  -0.186154 0.625555 1.927494
H  -3.279347 -0.826673 1.98346
H  -1.861738 -3.371322 1.973801
H  0.886398 2.752031 1.304955
H  2.11606 -0.923018 -0.506411
H  1.492282 -3.868961 -0.411396
H  2.88254 3.866467 0.41396
H  4.125221 0.178072 -1.387611
elementType: Cl O N C H
totalener: -1322.73844417 hartree
nucrepener: 1843.12635134 hartree
electener: -3165.86479550 hartree
oneelecener: -5468.08158748 hartree
twoeener: 2302.21679198 hartree
cpcmener: -0.02828202 hartree
kineticenergy: 1318.17790101 hartree
xcener: -106.459605503932 hartree
chargesum: -0.0000000
charge: -0.107057 -0.409486 0.129547 -0.352846 -0.405666 0.455433 0.170091 -0.328007 -0.234100 -0.335366 -0.349660 -0.356309 -0.044946 0.043894 0.060561 -0.231737 -0.224001 0.051433 -0.144392 -0.156868 0.092076 0.109610 0.115489 0.139131 0.124126 0.093212 0.099333 0.097759 0.099682 0.100600 0.101257 0.101683 0.101943 0.095493 0.101319 0.092523 0.205261 0.163078 0.140070 0.151075 0.163518 0.141688 0.139556
qa: -0.1071 -0.4095 0.1295 -0.3528 -0.4057 0.4554 0.1701 -0.3280 -0.2341 -0.3354 -0.3497 -0.3563 -0.0449 0.0439 0.0606 -0.2317 -0.2240 0.0514 -0.1444 -0.1569 0.0921 0.1096 0.1155 0.1391 0.1241 0.0932 0.0993 0.0978 0.0997 0.1006 0.1013 0.1017 0.1019 0.0955 0.1013 0.0925 0.2053 0.1631 0.1401 0.1511 0.1635 0.1417 0.1396
va: 1.1983 2.0159 3.3511 2.8456 3.0306 3.5977 3.8623 3.8443 3.9668 3.9232 3.9318 3.9280 3.7245 3.5357 4.0656 4.0084 3.9673 4.0319 3.9755 4.0273 3.8132 1.0083 1.0161 0.9864 1.0173 1.0190 1.0050 1.0050 1.0045 1.0052 1.0016 1.0052 0.9979 1.0100 1.0103 1.0347 1.0303 1.0067 1.0041 1.0032 0.9959 1.0058 1.0082
dispcorr: -0.024211703 hartree
energy: -1322.762655869236
dipole: -42.56518 39.36268 -3.20250 -1.58314 1.83896 0.25582 1.73788 -1.77811 -0.04022
magnitude: 3.21296 au
magnitude: 8.16669 debye
