program: Orca
programVersion: 4.2.1
elementType: Cl O N N N C C C C C C C C C C C C C C C C H H H H H H H H H H H H H H H H H H H H H H
charge: 0
multiplicity: 1
keywords: wb97x-d3
keywords: def2-TZVPP
keywords: def2/J RIJCOSX GRIDX6 NOFINALGRIDX
keywords: grid4 nofinalgrid
keywords: scfconv7
keywords: smallprint printgap noloewdin
keywords: NOSOSCF
formula: C16H22ClN3O
InChI: InChI=1/C16H22ClN3O/c1-15(2,3)16(21,10-20-12-18-11-19-20)9-8-13-4-6-14(17)7-5-13/h4-7,11-12,21H,8-10H2,1-3H3
43 atoms
Cl 5.350804 2.362921 0.101786
O  -2.64967 -0.838695 1.770614
N  -1.228803 -2.537277 -0.203962
N  -1.006505 -3.024367 1.020269
N  0.616011 -3.679048 -0.372494
C  -2.374019 -0.424452 0.453145
C  -3.566469 0.510805 0.048782
C  -0.990751 0.26351 0.475832
C  -2.34382 -1.657053 -0.479286
C  -3.421898 1.872567 0.736327
C  -3.671012 0.735291 -1.466154
C  -4.900907 -0.099527 0.503464
C  -0.389869 0.805554 -0.823985
C  1.047571 1.200843 -0.624253
C  -0.24862 -2.937257 -1.021178
C  1.406251 2.529468 -0.431318
C  2.052145 0.23754 -0.583088
C  0.109923 -3.700578 0.873473
C  2.724326 2.896921 -0.206445
C  3.373934 0.585152 -0.361643
C  3.702987 1.918518 -0.174015
H  -0.277657 -0.452662 0.895469
H  -1.027514 1.071077 1.208772
H  -3.271095 -2.22303 -0.379195
H  -2.245553 -1.365561 -1.523463
H  -2.589947 2.455976 0.338193
H  -3.280223 1.767343 1.811883
H  -4.327094 2.46201 0.579718
H  -4.420079 1.502823 -1.666907
H  -3.999539 -0.160062 -1.997081
H  -2.743339 1.07233 -1.925275
H  -5.72223 0.524215 0.144667
H  -5.066649 -1.100163 0.100332
H  -4.978665 -0.162445 1.585915
H  -0.951871 1.672766 -1.174434
H  -0.448696 0.061488 -1.624015
H  -2.055785 -1.567411 1.999364
H  -0.208352 -2.673989 -2.067359
H  0.64418 3.299343 -0.456893
H  1.805393 -0.809111 -0.722502
H  0.569147 -4.227522 1.694784
H  2.986995 3.935354 -0.059518
H  4.142536 -0.174766 -0.336249
totalener: -1322.71287433 hartree
nucrepener: 1848.02506992 hartree
electener: -3170.73794425 hartree
oneelecener: -5477.20057385 hartree
twoeener: 2306.46262960 hartree
kineticenergy: 1318.18533249 hartree
xcener: -106.462175758898 hartree
chargesum: 0.0000000
charge: -0.084168 -0.381403 0.145105 -0.353777 -0.332371 0.514736 0.173600 -0.316232 -0.277708 -0.340493 -0.360065 -0.323930 -0.140449 0.058450 0.006600 -0.176481 -0.202549 0.085706 -0.133108 -0.148273 0.097050 0.108845 0.114031 0.141577 0.104207 0.085040 0.112105 0.089032 0.098005 0.090827 0.108206 0.086837 0.077233 0.112403 0.083966 0.099438 0.193267 0.148689 0.109309 0.148987 0.136898 0.119563 0.121294
qa: -0.0842 -0.3814 0.1451 -0.3538 -0.3324 0.5147 0.1736 -0.3162 -0.2777 -0.3405 -0.3601 -0.3239 -0.1404 0.0584 0.0066 -0.1765 -0.2025 0.0857 -0.1331 -0.1483 0.0970 0.1088 0.1140 0.1416 0.1042 0.0850 0.1121 0.0890 0.0980 0.0908 0.1082 0.0868 0.0772 0.1124 0.0840 0.0994 0.1933 0.1487 0.1093 0.1490 0.1369 0.1196 0.1213
va: 1.2218 2.0660 3.2687 2.8589 3.0207 3.5808 3.7200 3.9857 3.9662 3.9275 3.9270 3.9657 3.7352 3.5887 4.0501 4.0333 3.9882 4.0160 4.0242 4.0775 3.9043 1.0215 1.0172 0.9986 0.9922 0.9985 1.0160 1.0117 1.0113 0.9976 1.0010 1.0027 1.0101 1.0165 1.0215 1.0069 1.0886 0.9981 1.0110 1.0007 1.0002 1.0132 1.0154
dispcorr: -0.024424188 hartree
energy: -1322.737298518715
dipole: -42.18494 41.06943 -1.11551 1.19601 -0.97125 0.22476 -3.30717 2.45924 -0.84793
magnitude: 1.41911 au
magnitude: 3.60708 debye
