program: Orca
programVersion: 4.2.1
elementType: Cl O N N N C C C C C C C C C C C C C C C C H H H H H H H H H H H H H H H H H H H H H H
charge: 0
multiplicity: 1
keywords: wb97x-d3
keywords: def2-TZVPP
keywords: def2/J RIJCOSX GRIDX6 NOFINALGRIDX
keywords: grid4 nofinalgrid
keywords: scfconv7
keywords: smallprint printgap noloewdin
keywords: NOSOSCF
formula: C16H22ClN3O
InChI: InChI=1/C16H22ClN3O/c1-15(2,3)16(21,10-20-12-18-11-19-20)9-8-13-4-6-14(17)7-5-13/h4-7,11-12,21H,8-10H2,1-3H3
43 atoms
Cl 5.222186 2.822697 -1.02453
O  -2.493393 -0.435003 1.70073
N  -1.34622 -2.603519 0.053243
N  -1.122197 -2.951418 1.324425
N  0.503196 -3.746356 0.009041
C  -2.417659 -0.365228 0.298953
C  -3.675215 0.447906 -0.161232
C  -1.111746 0.329692 -0.176312
C  -2.490429 -1.791381 -0.290171
C  -3.751935 1.769031 0.615636
C  -3.624557 0.766253 -1.659427
C  -4.968799 -0.327357 0.124613
C  0.088937 0.197159 0.751446
C  1.348839 0.866389 0.259316
C  -0.363224 -3.082582 -0.716843
C  1.419081 1.627065 -0.90139
C  2.516088 0.725696 1.009742
C  -0.001209 -3.633456 1.250335
C  2.60386 2.230751 -1.302675
C  3.704813 1.319029 0.627891
C  3.742023 2.074707 -0.534671
H  -1.302973 1.396528 -0.304079
H  -0.851043 -0.037753 -1.174718
H  -3.376334 -2.309191 0.075408
H  -2.544872 -1.759864 -1.377484
H  -4.602425 2.351858 0.257385
H  -2.865739 2.391028 0.485382
H  -3.888308 1.603954 1.68237
H  -3.559621 -0.127667 -2.283486
H  -2.790988 1.417192 -1.924641
H  -4.53809 1.285213 -1.953793
H  -5.002842 -0.689438 1.151796
H  -5.829928 0.326548 -0.022047
H  -5.110132 -1.176947 -0.546082
H  0.331577 -0.848515 0.949156
H  -0.172348 0.62627 1.721942
H  -1.99729 -1.203149 2.016591
H  -0.322082 -2.93107 -1.784589
H  0.543358 1.764972 -1.521274
H  2.494876 0.134161 1.917671
H  0.45982 -4.068679 2.122883
H  2.63574 2.81849 -2.209787
H  4.596818 1.195081 1.226282
totalener: -1322.71226365 hartree
nucrepener: 1836.57942983 hartree
electener: -3159.29169348 hartree
oneelecener: -5454.44366330 hartree
twoeener: 2295.15196982 hartree
kineticenergy: 1318.17727586 hartree
xcener: -106.463062957967 hartree
chargesum: 0.0000000
charge: -0.087529 -0.382906 0.120748 -0.356043 -0.318832 0.489895 0.200487 -0.336994 -0.247670 -0.323731 -0.335822 -0.361432 -0.083574 0.065634 0.050669 -0.167115 -0.194438 0.075251 -0.168565 -0.143868 0.108109 0.086430 0.092421 0.140946 0.103167 0.086805 0.088295 0.112294 0.085922 0.093822 0.097422 0.115902 0.091365 0.082056 0.082923 0.107683 0.197372 0.139769 0.110778 0.112296 0.134886 0.116963 0.118207
qa: -0.0875 -0.3829 0.1207 -0.3560 -0.3188 0.4899 0.2005 -0.3370 -0.2477 -0.3237 -0.3358 -0.3614 -0.0836 0.0656 0.0507 -0.1671 -0.1944 0.0753 -0.1686 -0.1439 0.1081 0.0864 0.0924 0.1409 0.1032 0.0868 0.0883 0.1123 0.0859 0.0938 0.0974 0.1159 0.0914 0.0821 0.0829 0.1077 0.1974 0.1398 0.1108 0.1123 0.1349 0.1170 0.1182
va: 1.2191 2.0552 3.3227 2.8292 3.0620 3.5750 3.7773 3.9736 3.9710 3.9388 3.9375 3.9218 3.8055 3.7243 4.0594 3.9658 4.0592 4.0206 4.0939 4.0327 3.9026 1.0051 0.9937 0.9939 1.0025 1.0047 1.0040 1.0164 1.0080 1.0030 1.0089 1.0205 1.0093 0.9973 1.0057 1.0163 1.0832 1.0029 1.0127 1.0105 1.0016 1.0156 1.0131
dispcorr: -0.023455967 hartree
energy: -1322.735719620886
dipole: -42.16069 40.86521 -1.29548 -2.00193 1.83877 -0.16316 0.05940 -0.62550 -0.56610
magnitude: 1.42315 au
magnitude: 3.61737 debye
