program: Orca
programVersion: 4.2.1
elementType: Cl O N N N C C C C C C C C C C C C C C C C H H H H H H H H H H H H H H H H H H H H H H
charge: 0
multiplicity: 1
keywords: wb97x-d3
keywords: def2-TZVPP
keywords: def2/J RIJCOSX GRIDX6 NOFINALGRIDX
keywords: grid4 nofinalgrid
keywords: scfconv7
keywords: smallprint printgap noloewdin
keywords: NOSOSCF
formula: C16H22ClN3O
InChI: InChI=1/C16H22ClN3O/c1-15(2,3)16(21,10-20-12-18-11-19-20)9-8-13-4-6-14(17)7-5-13/h4-7,11-12,21H,8-10H2,1-3H3
43 atoms
Cl 4.20953 3.424591 0.9902
O  -0.70154 -0.424221 1.168797
N  -1.373774 -2.844613 -0.186191
N  -1.399325 -3.315182 -1.436614
N  0.299563 -4.228121 -0.293913
C  -1.722606 -0.409123 0.195694
C  -2.830618 0.628437 0.59755
C  -1.179834 -0.114834 -1.227056
C  -2.299582 -1.832693 0.256705
C  -3.896725 0.769817 -0.494544
C  -3.526094 0.217904 1.90171
C  -2.189831 2.001527 0.838416
C  0.297693 -0.43154 -1.493708
C  1.271514 0.53224 -0.865377
C  -0.352621 -3.397332 0.48179
C  2.23309 0.09615 0.04248
C  1.250093 1.887899 -1.188109
C  -0.379523 -4.140359 -1.455908
C  3.139834 0.975404 0.615117
C  2.146192 2.781577 -0.624859
C  3.088784 2.317997 0.279378
H  -1.337634 0.937386 -1.472601
H  -1.781266 -0.666974 -1.952009
H  -2.582792 -2.070517 1.281737
H  -3.186775 -1.925503 -0.36608
H  -4.672851 1.462342 -0.164365
H  -4.393861 -0.174789 -0.72069
H  -3.495336 1.162701 -1.428603
H  -4.156128 1.034348 2.258463
H  -2.80701 -0.008578 2.689323
H  -4.18038 -0.646172 1.775899
H  -1.54655 2.005031 1.719254
H  -1.601609 2.359464 -0.008366
H  -2.967968 2.744737 1.018806
H  0.438163 -0.40093 -2.577663
H  0.554627 -1.44662 -1.196489
H  -0.1428 0.352168 1.071419
H  -0.128175 -3.165599 1.510542
H  2.274125 -0.953215 0.308124
H  0.525968 2.260038 -1.903767
H  -0.122332 -4.705763 -2.337877
H  3.879384 0.617557 1.318083
H  2.116285 3.829251 -0.890746
totalener: -1322.71228003 hartree
nucrepener: 1887.02981722 hartree
electener: -3209.74209725 hartree
oneelecener: -5555.38073944 hartree
twoeener: 2345.63864219 hartree
kineticenergy: 1318.18820671 hartree
xcener: -106.462595760951 hartree
chargesum: -0.0000000
charge: -0.080465 -0.377707 0.117291 -0.317556 -0.331922 0.442637 0.181567 -0.274954 -0.249741 -0.328161 -0.350613 -0.366320 -0.086847 0.010797 0.032400 -0.172863 -0.258308 0.053446 -0.108736 -0.098354 0.075374 0.092120 0.118403 0.129737 0.123638 0.094713 0.094225 0.095545 0.092039 0.108486 0.085895 0.100315 0.097351 0.094596 0.109038 0.082494 0.195953 0.143966 0.131302 0.123278 0.129401 0.124036 0.122502
qa: -0.0805 -0.3777 0.1173 -0.3176 -0.3319 0.4426 0.1816 -0.2750 -0.2497 -0.3282 -0.3506 -0.3663 -0.0868 0.0108 0.0324 -0.1729 -0.2583 0.0534 -0.1087 -0.0984 0.0754 0.0921 0.1184 0.1297 0.1236 0.0947 0.0942 0.0955 0.0920 0.1085 0.0859 0.1003 0.0974 0.0946 0.1090 0.0825 0.1960 0.1440 0.1313 0.1233 0.1294 0.1240 0.1225
va: 1.2257 2.0618 3.3266 2.8417 3.0360 3.5772 3.8213 3.8862 3.9342 3.9426 3.9146 3.9220 3.8486 3.6194 4.0600 3.9402 4.0111 4.0433 4.0066 3.9858 3.9352 1.0107 1.0185 0.9950 1.0192 1.0079 1.0086 1.0027 1.0096 1.0210 0.9982 1.0098 1.0057 1.0122 1.0037 1.0254 1.0565 1.0143 1.0075 1.0073 1.0035 1.0117 1.0116
dispcorr: -0.025717748 hartree
energy: -1322.737997775520
dipole: -34.07851 32.94460 -1.13391 -1.86625 2.76462 0.89837 -1.45968 1.47375 0.01407
magnitude: 1.44673 au
magnitude: 3.67729 debye
