program: Orca
programVersion: 5.0.2
elementType: O O N C C C C C C C C C C C C C C C C C C H H H H H H H H H H H H H H H H H H H H H H H H H H H H H H H H H H H
charge: 0
multiplicity: 1
keywords: wb97x-d3
keywords: def2-TZVPP
keywords: def2/J RIJCOSX
keywords: DEFGRID2
keywords: scfconv7
keywords: smallprint printgap noloewdin
keywords: NOSOSCF
formula: C18H35NO2
InChI: InChI=1/C18H35NO2/c1-6-12-19(7-2)13-16-14-20-18(21-16)10-8-15(9-11-18)17(3,4)5/h15-16H,6-14H2,1-5H3
56 atoms
O  -0.553824 0.8274 0.357852
O  -0.111682 3.037407 0.191551
N  -3.049583 -0.64061 0.187259
C  2.924538 0.017342 0.208883
C  0.501737 1.754804 0.236573
C  2.011258 0.167862 -1.011897
C  2.12007 0.280182 1.485749
C  3.712121 -1.320043 0.233691
C  1.29561 1.515562 -1.041376
C  1.405325 1.628392 1.44968
C  -1.716492 1.428158 -0.182988
C  -1.519578 2.880408 0.218851
C  4.641326 -1.351662 1.450982
C  2.786365 -2.537166 0.289547
C  4.587789 -1.428337 -1.018252
C  -2.960555 0.792958 0.392116
C  -3.163506 -1.038622 -1.212521
C  -4.084695 -1.228552 1.027573
C  -1.846489 -1.396059 -1.901234
C  -5.518476 -0.779284 0.764745
C  -1.064153 -2.503287 -1.213355
H  3.681507 0.812793 0.141681
H  2.583944 0.063625 -1.934599
H  1.267415 -0.634442 -1.023352
H  1.387217 -0.517151 1.641702
H  2.772973 0.267267 2.359457
H  0.63338 1.572437 -1.910702
H  2.029369 2.319986 -1.14994
H  2.147105 2.431236 1.409212
H  0.820998 1.777204 2.361921
H  -1.718452 1.351533 -1.277973
H  -1.91749 3.076313 1.222011
H  -1.982962 3.579254 -0.47894
H  4.095904 -1.401165 2.394105
H  5.292274 -2.227851 1.412878
H  5.283626 -0.468007 1.484754
H  3.373608 -3.457084 0.337791
H  2.148756 -2.61117 -0.593282
H  2.137544 -2.523763 1.167046
H  5.232463 -0.552829 -1.129962
H  5.235036 -2.306038 -0.958333
H  4.000447 -1.526314 -1.931953
H  -3.816282 1.339941 -0.036222
H  -2.977771 0.982874 1.469633
H  -3.800031 -1.9261 -1.262773
H  -3.681159 -0.271539 -1.806758
H  -4.024555 -2.31412 0.919458
H  -3.832032 -1.016839 2.070434
H  -1.208224 -0.5184 -2.021594
H  -2.101118 -1.711907 -2.917123
H  -6.201289 -1.314811 1.426036
H  -5.657848 0.286493 0.949735
H  -5.830651 -0.984678 -0.26094
H  -0.69422 -2.193931 -0.236121
H  -0.198404 -2.797136 -1.808583
H  -1.678212 -3.394746 -1.067603
elementType: O N C H
totalener: -912.30068723 hartree
nucrepener: 1952.23406397 hartree
electener: -2864.53475120 hartree
oneelecener: -5118.59482339 hartree
twoeener: 2254.06007219 hartree
cpcmener: -0.02273117 hartree
kineticenergy: 907.80529226 hartree
xcener: -92.075271071877 hartree
chargesum: 0.0000000
charge: -0.416762 -0.429903 -0.205026 0.101385 0.620053 -0.218517 -0.231339 0.275343 -0.289198 -0.262813 0.125106 0.038789 -0.359911 -0.390250 -0.365464 -0.172157 -0.101678 -0.046717 -0.089842 -0.279472 -0.296790 0.059243 0.089714 0.046445 0.077091 0.089122 0.092361 0.092139 0.081683 0.082332 0.087127 0.074079 0.097497 0.095015 0.094864 0.099085 0.101798 0.087549 0.101264 0.098464 0.095570 0.095105 0.083017 0.087743 0.091465 0.091771 0.075524 0.077022 0.051364 0.076680 0.096328 0.085436 0.084240 0.057188 0.101770 0.098067
qa: -0.4168 -0.4299 -0.2050 0.1014 0.6201 -0.2185 -0.2313 0.2753 -0.2892 -0.2628 0.1251 0.0388 -0.3599 -0.3903 -0.3655 -0.1722 -0.1017 -0.0467 -0.0898 -0.2795 -0.2968 0.0592 0.0897 0.0464 0.0771 0.0891 0.0924 0.0921 0.0817 0.0823 0.0871 0.0741 0.0975 0.0950 0.0949 0.0991 0.1018 0.0875 0.1013 0.0985 0.0956 0.0951 0.0830 0.0877 0.0915 0.0918 0.0755 0.0770 0.0514 0.0767 0.0963 0.0854 0.0842 0.0572 0.1018 0.0981
va: 1.9771 1.9760 2.8284 3.6805 3.7019 4.0017 3.9229 3.6580 4.0437 4.0469 3.8702 4.0131 3.9221 3.9546 3.9224 4.0554 3.8889 3.9246 3.8348 3.8886 3.9162 1.0159 1.0161 1.0050 1.0185 1.0125 1.0097 1.0209 1.0188 1.0242 0.9942 0.9988 0.9944 0.9982 1.0072 1.0024 1.0074 0.9991 0.9979 1.0028 1.0065 0.9988 0.9982 1.0082 0.9931 1.0034 0.9970 1.0001 1.0095 1.0124 1.0093 0.9992 1.0014 1.0246 1.0015 1.0054
dispcorr: -0.031429521 hartree
energy: -912.332116752295
dipole: 2.72958 -3.62495 -0.89536 -15.54762 15.57634 0.02872 -2.34550 1.89186 -0.45364
magnitude: 1.00414 au
magnitude: 2.55231 debye
