program: Orca
programVersion: 5.0.2
elementType: O O N C C C C C C C C C C C C C C C C C C H H H H H H H H H H H H H H H H H H H H H H H H H H H H H H H H H H H
charge: 0
multiplicity: 1
keywords: wb97x-d3
keywords: def2-TZVPP
keywords: def2/J RIJCOSX
keywords: DEFGRID2
keywords: scfconv7
keywords: smallprint printgap noloewdin
keywords: NOSOSCF
formula: C18H35NO2
InChI: InChI=1/C18H35NO2/c1-6-12-19(7-2)13-16-14-20-18(21-16)10-8-15(9-11-18)17(3,4)5/h15-16H,6-14H2,1-5H3
56 atoms
O  -0.512136 1.101593 -0.594558
O  -0.042045 3.110026 0.291608
N  -3.478269 -0.072615 -0.674595
C  2.804522 -0.058296 0.353579
C  0.500626 1.823947 0.09043
C  2.425765 0.585621 -0.982981
C  1.537715 -0.20137 1.201587
C  3.626228 -1.366696 0.218191
C  1.735258 1.9324 -0.785583
C  0.844995 1.142182 1.4127
C  -1.770937 1.744548 -0.416171
C  -1.429823 2.934303 0.481268
C  4.099588 -1.823127 1.601367
C  2.818825 -2.497418 -0.419865
C  4.874354 -1.111262 -0.63309
C  -2.829666 0.860955 0.22142
C  -2.62397 -1.103066 -1.242033
C  -4.759522 -0.535012 -0.161755
C  -1.914678 -2.086012 -0.30807
C  -4.807289 -1.148384 1.235588
C  -0.90576 -2.924143 -1.078325
H  3.461362 0.654609 0.874185
H  3.310024 0.749258 -1.600076
H  1.77383 -0.084644 -1.552316
H  0.843533 -0.898674 0.722077
H  1.768091 -0.626412 2.17979
H  1.463301 2.370613 -1.749411
H  2.433817 2.623979 -0.305051
H  1.511741 1.805352 1.972379
H  -0.054854 1.009757 2.020409
H  -2.124388 2.091523 -1.393043
H  -1.671052 2.727444 1.531758
H  -1.950383 3.84524 0.186717
H  4.752417 -2.694362 1.513843
H  4.667584 -1.03777 2.106268
H  3.273959 -2.10748 2.255022
H  3.440149 -3.388753 -0.534735
H  2.4505 -2.232464 -1.412815
H  1.958713 -2.782676 0.188279
H  5.530515 -1.984326 -0.620266
H  4.634466 -0.908196 -1.677431
H  5.449776 -0.263178 -0.253418
H  -3.607974 1.537295 0.591274
H  -2.3902 0.396978 1.118075
H  -3.233331 -1.676504 -1.947096
H  -1.865899 -0.612414 -1.858678
H  -5.449148 0.315415 -0.171863
H  -5.160614 -1.252937 -0.88107
H  -2.640691 -2.746683 0.169837
H  -1.403344 -1.553273 0.498089
H  -5.838994 -1.409077 1.478157
H  -4.212817 -2.05679 1.320143
H  -4.465005 -0.451569 2.001876
H  -1.38448 -3.473106 -1.892174
H  -0.416094 -3.655667 -0.434637
H  -0.126497 -2.29942 -1.519901
elementType: O N C H
totalener: -912.30133329 hartree
nucrepener: 1955.06095890 hartree
electener: -2867.36229219 hartree
oneelecener: -5123.75278971 hartree
twoeener: 2256.39049751 hartree
cpcmener: -0.01996658 hartree
kineticenergy: 907.79979763 hartree
xcener: -92.076398492036 hartree
chargesum: -0.0000000
charge: -0.424177 -0.404134 -0.211240 0.093219 0.574221 -0.219058 -0.217442 0.291025 -0.279413 -0.292293 0.258581 -0.031952 -0.365450 -0.413748 -0.360701 -0.226097 -0.094501 -0.058584 -0.130949 -0.273544 -0.306941 0.057970 0.089794 0.075953 0.048857 0.093108 0.081046 0.086158 0.086978 0.095941 0.073123 0.086516 0.111767 0.096053 0.098007 0.096086 0.105157 0.102088 0.094519 0.096148 0.094378 0.100678 0.107058 0.086499 0.094562 0.080960 0.078304 0.075163 0.086654 0.076708 0.096586 0.083890 0.086170 0.098630 0.099955 0.071711
qa: -0.4242 -0.4041 -0.2112 0.0932 0.5742 -0.2191 -0.2174 0.2910 -0.2794 -0.2923 0.2586 -0.0320 -0.3655 -0.4137 -0.3607 -0.2261 -0.0945 -0.0586 -0.1309 -0.2735 -0.3069 0.0580 0.0898 0.0760 0.0489 0.0931 0.0810 0.0862 0.0870 0.0959 0.0731 0.0865 0.1118 0.0961 0.0980 0.0961 0.1052 0.1021 0.0945 0.0961 0.0944 0.1007 0.1071 0.0865 0.0946 0.0810 0.0783 0.0752 0.0867 0.0767 0.0966 0.0839 0.0862 0.0986 0.1000 0.0717
va: 1.9532 1.9928 2.9234 3.6688 3.7507 3.9173 3.9942 3.6372 4.0520 4.0238 3.7219 3.9952 3.9219 3.9688 3.9219 4.0174 3.9210 3.9430 3.7864 3.8580 3.9581 1.0169 1.0144 1.0138 1.0081 1.0159 1.0290 1.0165 1.0232 1.0117 1.0195 0.9996 0.9945 1.0059 1.0030 1.0003 1.0090 0.9939 0.9907 1.0069 0.9984 1.0022 0.9961 0.9807 1.0039 1.0102 0.9954 1.0009 1.0086 0.9965 1.0095 1.0045 0.9999 1.0047 1.0000 0.9990
dispcorr: -0.032002407 hartree
energy: -912.333335698146
dipole: 4.63592 -5.08715 -0.45123 -18.77989 18.42824 -0.35165 2.94302 -2.11485 0.82817
magnitude: 1.00654 au
magnitude: 2.55843 debye
