program: Orca
programVersion: 5.0.2
elementType: O O N C C C C C C C C C C C C C C C C C C H H H H H H H H H H H H H H H H H H H H H H H H H H H H H H H H H H H
charge: 0
multiplicity: 1
keywords: wb97x-d3
keywords: def2-TZVPP
keywords: def2/J RIJCOSX
keywords: DEFGRID2
keywords: scfconv7
keywords: smallprint printgap noloewdin
keywords: NOSOSCF
formula: C18H35NO2
InChI: InChI=1/C18H35NO2/c1-6-12-19(7-2)13-16-14-20-18(21-16)10-8-15(9-11-18)17(3,4)5/h15-16H,6-14H2,1-5H3
56 atoms
O  -0.109995 -0.127872 0.124124
O  -0.378874 2.004807 0.825807
N  -3.676797 -1.107757 -0.165568
C  3.431898 0.367584 -0.218309
C  0.594788 1.06561 0.397593
C  2.401557 0.649618 -1.317165
C  2.712805 -0.152869 1.031209
C  4.604628 -0.536369 -0.685662
C  1.291729 1.588236 -0.851941
C  1.612004 0.796548 1.494198
C  -1.483471 0.186531 -0.063738
C  -1.644139 1.369936 0.875821
C  5.346664 0.135146 -1.845311
C  5.608678 -0.721099 0.45635
C  4.128972 -1.916519 -1.143787
C  -2.291283 -1.071606 0.260014
C  -4.55156 -0.17517 0.530057
C  -3.857421 -0.964156 -1.605941
C  -4.673589 -0.390099 2.030741
C  -3.027692 -1.914456 -2.448163
C  -5.694088 0.566204 2.631449
H  3.88316 1.33313 0.054511
H  2.882239 1.097276 -2.188311
H  1.957274 -0.288331 -1.662122
H  2.285441 -1.141007 0.837229
H  3.417221 -0.281776 1.853987
H  0.559899 1.733436 -1.65226
H  1.713407 2.572442 -0.626317
H  2.058059 1.752012 1.785579
H  1.105179 0.395752 2.37657
H  -1.658882 0.502634 -1.101036
H  -1.877904 1.039434 1.895487
H  -2.411679 2.075396 0.556073
H  5.682704 1.139363 -1.575317
H  6.231704 -0.443548 -2.119037
H  4.73236 0.221153 -2.742239
H  5.938083 0.240837 0.856961
H  6.496022 -1.250086 0.101914
H  5.200637 -1.302573 1.283855
H  4.981553 -2.528138 -1.44758
H  3.61191 -2.458822 -0.350207
H  3.454814 -1.859096 -1.999866
H  -2.245266 -1.251844 1.336318
H  -1.775395 -1.918351 -0.19754
H  -4.28006 0.875634 0.336365
H  -5.549145 -0.297568 0.09783
H  -4.913234 -1.152526 -1.816075
H  -3.670121 0.066336 -1.945684
H  -3.713421 -0.243158 2.530041
H  -4.973985 -1.422051 2.22804
H  -3.18165 -2.953717 -2.155683
H  -3.325524 -1.818689 -3.492427
H  -1.959103 -1.703186 -2.401043
H  -5.401947 1.60647 2.477187
H  -5.800133 0.41158 3.705176
H  -6.678719 0.430957 2.18027
elementType: O N C H
totalener: -912.30369382 hartree
nucrepener: 1884.05345501 hartree
electener: -2796.35714883 hartree
oneelecener: -4981.31502308 hartree
twoeener: 2184.95787425 hartree
cpcmener: -0.02015295 hartree
kineticenergy: 907.80049362 hartree
xcener: -92.074219246645 hartree
chargesum: 0.0000000
charge: -0.429586 -0.430162 -0.201922 0.095408 0.612521 -0.242718 -0.232211 0.258786 -0.279739 -0.269367 0.102776 0.032350 -0.361178 -0.363191 -0.377714 -0.143968 -0.124581 -0.077868 -0.069916 -0.264783 -0.285178 0.058760 0.087429 0.081626 0.080476 0.088168 0.085048 0.087827 0.080679 0.084642 0.087419 0.086542 0.098978 0.098091 0.095801 0.094792 0.099270 0.096136 0.094741 0.098342 0.097559 0.096507 0.108384 0.099980 0.073089 0.098710 0.087434 0.069907 0.058923 0.060563 0.082700 0.095034 0.082065 0.081598 0.092911 0.082112
qa: -0.4296 -0.4302 -0.2019 0.0954 0.6125 -0.2427 -0.2322 0.2588 -0.2797 -0.2694 0.1028 0.0323 -0.3612 -0.3632 -0.3777 -0.1440 -0.1246 -0.0779 -0.0699 -0.2648 -0.2852 0.0588 0.0874 0.0816 0.0805 0.0882 0.0850 0.0878 0.0807 0.0846 0.0874 0.0865 0.0990 0.0981 0.0958 0.0948 0.0993 0.0961 0.0947 0.0983 0.0976 0.0965 0.1084 0.1000 0.0731 0.0987 0.0874 0.0699 0.0589 0.0606 0.0827 0.0950 0.0821 0.0816 0.0929 0.0821
va: 1.9666 1.9795 2.9366 3.6811 3.7225 3.9448 3.9228 3.6752 4.0499 4.0584 3.7905 3.9481 3.9216 3.9231 3.9431 3.9705 3.9447 3.9221 3.8215 3.9095 3.9523 1.0163 1.0144 1.0148 1.0186 1.0121 1.0144 1.0184 1.0197 1.0202 0.9966 1.0009 0.9975 1.0032 1.0062 0.9999 1.0024 1.0067 0.9984 1.0043 1.0007 0.9999 0.9985 1.0042 0.9975 0.9974 0.9937 0.9918 1.0123 1.0201 1.0093 1.0058 1.0013 1.0003 1.0040 1.0009
dispcorr: -0.028579416 hartree
energy: -912.332273238905
dipole: 2.83602 -3.19129 -0.35527 -5.73884 5.97641 0.23757 -3.24605 2.92619 -0.31986
magnitude: 0.53382 au
magnitude: 1.35687 debye
