program: Orca
programVersion: 5.0.2
elementType: O O N C C C C C C C C C C C C C C C C C C H H H H H H H H H H H H H H H H H H H H H H H H H H H H H H H H H H H
charge: 0
multiplicity: 1
keywords: wb97x-d3
keywords: def2-TZVPP
keywords: def2/J RIJCOSX
keywords: DEFGRID2
keywords: scfconv7
keywords: smallprint printgap noloewdin
keywords: NOSOSCF
formula: C18H35NO2
InChI: InChI=1/C18H35NO2/c1-6-12-19(7-2)13-16-14-20-18(21-16)10-8-15(9-11-18)17(3,4)5/h15-16H,6-14H2,1-5H3
56 atoms
O  -0.28367 0.782448 -0.585224
O  -0.318974 2.418036 0.978113
N  -2.698012 -0.818717 0.004252
C  3.187277 0.162452 0.053739
C  0.522114 1.459793 0.367876
C  2.643177 1.172785 -0.961004
C  2.015913 -0.541153 0.746018
C  4.240074 -0.810704 -0.538826
C  1.675184 2.167111 -0.325178
C  1.053478 0.45738 1.38281
C  -1.585057 1.349197 -0.597518
C  -1.658514 2.009112 0.764704
C  3.664908 -1.678131 -1.659972
C  5.425324 -0.01456 -1.093402
C  4.776832 -1.726478 0.565434
C  -2.649528 0.311354 -0.907735
C  -4.037887 -1.100155 0.497769
C  -2.039704 -2.007773 -0.523128
C  -4.533029 -0.093212 1.524711
C  -2.748731 -2.729947 -1.664495
C  -5.945496 -0.415046 1.988383
H  3.713751 0.739647 0.828443
H  3.457723 1.736186 -1.418429
H  2.137808 0.648949 -1.777594
H  1.475099 -1.168825 0.030746
H  2.376739 -1.211942 1.526848
H  1.285511 2.855538 -1.080342
H  2.208228 2.771576 0.415039
H  1.579599 1.01469 2.16377
H  0.222591 -0.065017 1.865895
H  -1.648503 2.120004 -1.378541
H  -1.994018 1.312696 1.53973
H  -2.305844 2.886052 0.779172
H  4.43145 -2.353749 -2.046579
H  2.833777 -2.297627 -1.318077
H  3.309603 -1.081885 -2.502135
H  5.841431 0.65787 -0.338893
H  5.156425 0.587547 -1.962139
H  6.225167 -0.688471 -1.408266
H  5.609906 -2.326924 0.19319
H  5.143716 -1.148783 1.417699
H  4.02294 -2.421934 0.936128
H  -2.51872 -0.010809 -1.94794
H  -3.602513 0.847307 -0.900959
H  -4.775839 -1.168578 -0.317334
H  -4.018592 -2.086517 0.970458
H  -1.035766 -1.729297 -0.847074
H  -1.900682 -2.710995 0.30285
H  -4.512956 0.918016 1.108052
H  -3.852349 -0.088483 2.380092
H  -3.71453 -3.133479 -1.357821
H  -2.916653 -2.080991 -2.525813
H  -2.139821 -3.568722 -2.005181
H  -6.652914 -0.389248 1.15744
H  -6.291725 0.300483 2.734682
H  -6.001468 -1.409197 2.435908
elementType: O N C H
totalener: -912.30196686 hartree
nucrepener: 1913.67363357 hartree
electener: -2825.97560044 hartree
oneelecener: -5041.40088258 hartree
twoeener: 2215.42528215 hartree
cpcmener: -0.01965412 hartree
kineticenergy: 907.80904915 hartree
xcener: -92.075475205427 hartree
chargesum: -0.0000000
charge: -0.438551 -0.419171 -0.233540 0.092417 0.611364 -0.227116 -0.244779 0.267334 -0.281023 -0.280575 0.183390 -0.017903 -0.378906 -0.359758 -0.364822 -0.122485 -0.079505 -0.056115 -0.080677 -0.283101 -0.291457 0.058875 0.090081 0.076916 0.082662 0.089135 0.082062 0.084948 0.085219 0.081688 0.069637 0.080546 0.110832 0.098296 0.096229 0.097481 0.098991 0.094250 0.095268 0.095756 0.099389 0.095039 0.101093 0.101359 0.068828 0.084017 0.073670 0.078023 0.062618 0.054966 0.086601 0.081880 0.095438 0.080081 0.091633 0.081475
qa: -0.4386 -0.4192 -0.2335 0.0924 0.6114 -0.2271 -0.2448 0.2673 -0.2810 -0.2806 0.1834 -0.0179 -0.3789 -0.3598 -0.3648 -0.1225 -0.0795 -0.0561 -0.0807 -0.2831 -0.2915 0.0589 0.0901 0.0769 0.0827 0.0891 0.0821 0.0849 0.0852 0.0817 0.0696 0.0805 0.1108 0.0983 0.0962 0.0975 0.0990 0.0942 0.0953 0.0958 0.0994 0.0950 0.1011 0.1014 0.0688 0.0840 0.0737 0.0780 0.0626 0.0550 0.0866 0.0819 0.0954 0.0801 0.0916 0.0815
va: 1.9658 1.9794 2.8376 3.6816 3.7020 3.9167 3.9523 3.6644 4.0689 4.0319 3.9391 3.9724 3.9456 3.9205 3.9239 3.8852 3.9114 3.9438 3.8465 3.9118 3.9683 1.0172 1.0137 1.0214 1.0019 1.0139 1.0202 1.0170 1.0232 1.0235 1.0071 1.0135 0.9968 1.0045 1.0009 0.9998 1.0027 1.0001 1.0065 1.0065 1.0025 0.9981 1.0059 1.0014 0.9907 0.9960 1.0044 0.9986 1.0096 1.0150 0.9985 1.0034 1.0090 1.0018 1.0035 1.0000
dispcorr: -0.029481838 hartree
energy: -912.331448702472
dipole: 0.84992 -1.62055 -0.77063 -13.02072 12.71416 -0.30655 -2.13170 1.80539 -0.32631
magnitude: 0.89125 au
magnitude: 2.26538 debye
