program: Orca
programVersion: 5.0.2
elementType: O O N C C C C C C C C C C C C C C C C C C H H H H H H H H H H H H H H H H H H H H H H H H H H H H H H H H H H H
charge: 0
multiplicity: 1
keywords: wb97x-d3
keywords: def2-TZVPP
keywords: def2/J RIJCOSX
keywords: DEFGRID2
keywords: scfconv7
keywords: smallprint printgap noloewdin
keywords: NOSOSCF
formula: C18H35NO2
InChI: InChI=1/C18H35NO2/c1-6-12-19(7-2)13-16-14-20-18(21-16)10-8-15(9-11-18)17(3,4)5/h15-16H,6-14H2,1-5H3
56 atoms
O  -0.146963 0.380017 -0.780857
O  -0.509403 1.387668 1.212923
N  -3.753107 -0.352948 -0.214601
C  3.374866 0.107275 0.022787
C  0.504596 0.830648 0.40335
C  2.715612 1.254489 -0.748042
C  2.308054 -0.938621 0.358114
C  4.634488 -0.474951 -0.67014
C  1.557988 1.868346 0.034042
C  1.144653 -0.334756 1.138821
C  -1.536076 0.682146 -0.704899
C  -1.567455 1.768292 0.35368
C  4.329652 -1.030794 -2.062475
C  5.700421 0.617069 -0.801098
C  5.228523 -1.596887 0.186567
C  -2.317714 -0.577721 -0.336267
C  -4.29447 -0.974183 0.988871
C  -4.482988 -0.813845 -1.38893
C  -3.890912 -0.284973 2.283886
C  -4.115388 -0.102205 -2.677241
C  -4.461113 -1.003465 3.497565
H  3.724358 0.523358 0.979613
H  3.437814 2.042989 -0.965084
H  2.354034 0.896205 -1.716576
H  1.93341 -1.400946 -0.560367
H  2.730513 -1.74704 0.956143
H  1.100306 2.680716 -0.537704
H  1.942887 2.306873 0.959791
H  1.509867 0.027469 2.104617
H  0.387907 -1.096095 1.34752
H  -1.861756 1.067131 -1.673645
H  -2.494538 1.805764 0.922985
H  -1.393816 2.757369 -0.086213
H  3.56864 -1.813084 -2.037254
H  3.985126 -0.25596 -2.74946
H  5.228908 -1.470851 -2.49946
H  5.392162 1.425977 -1.46454
H  6.624694 0.202588 -1.209595
H  5.939061 1.057522 0.170182
H  5.395751 -1.267785 1.215416
H  4.590242 -2.480623 0.220008
H  6.192663 -1.914784 -0.216391
H  -1.922286 -0.959774 0.607983
H  -2.098708 -1.358014 -1.078263
H  -5.384992 -0.942415 0.918477
H  -4.026204 -2.042609 1.045997
H  -4.357539 -1.899561 -1.534999
H  -5.546897 -0.65271 -1.201064
H  -4.244903 0.749068 2.265217
H  -2.802645 -0.237662 2.376249
H  -3.091198 -0.303349 -2.993445
H  -4.769416 -0.447526 -3.478865
H  -4.239836 0.977867 -2.590614
H  -5.551153 -1.048173 3.459836
H  -4.185927 -0.496933 4.422997
H  -4.091939 -2.02856 3.562416
elementType: O N C H
totalener: -912.30340434 hartree
nucrepener: 1890.25996448 hartree
electener: -2802.56336882 hartree
oneelecener: -4994.19904332 hartree
twoeener: 2191.63567450 hartree
cpcmener: -0.01806513 hartree
kineticenergy: 907.80559991 hartree
xcener: -92.070921641257 hartree
chargesum: 0.0000000
charge: -0.459182 -0.425791 -0.234401 0.089058 0.581189 -0.228329 -0.223206 0.262361 -0.271745 -0.286822 0.283691 -0.024035 -0.375243 -0.359911 -0.363072 -0.248346 -0.090980 -0.061635 -0.064426 -0.268439 -0.289668 0.056813 0.089270 0.077484 0.077921 0.087158 0.084512 0.079767 0.089093 0.089923 0.108585 0.107102 0.098686 0.098188 0.094778 0.098108 0.094531 0.095463 0.098106 0.100205 0.094374 0.095134 0.121934 0.097720 0.084967 0.072943 0.062274 0.080284 0.055715 0.053008 0.085428 0.097333 0.077097 0.081806 0.092631 0.080587
qa: -0.4592 -0.4258 -0.2344 0.0891 0.5812 -0.2283 -0.2232 0.2624 -0.2717 -0.2868 0.2837 -0.0240 -0.3752 -0.3599 -0.3631 -0.2483 -0.0910 -0.0616 -0.0644 -0.2684 -0.2897 0.0568 0.0893 0.0775 0.0779 0.0872 0.0845 0.0798 0.0891 0.0899 0.1086 0.1071 0.0987 0.0982 0.0948 0.0981 0.0945 0.0955 0.0981 0.1002 0.0944 0.0951 0.1219 0.0977 0.0850 0.0729 0.0623 0.0803 0.0557 0.0530 0.0854 0.0973 0.0771 0.0818 0.0926 0.0806
va: 1.9719 1.9531 2.8426 3.6793 3.7698 3.9266 3.9292 3.6676 4.0817 4.0405 3.7442 3.9499 3.9443 3.9225 3.9245 3.9335 3.9226 3.9256 3.8195 3.9010 3.9676 1.0169 1.0135 1.0208 1.0198 1.0143 1.0156 1.0207 1.0181 1.0166 0.9961 1.0113 0.9998 1.0007 0.9995 1.0042 1.0013 1.0058 1.0032 1.0022 0.9983 1.0067 0.9854 1.0165 0.9983 1.0026 1.0047 0.9963 1.0164 1.0221 0.9992 1.0080 1.0110 1.0003 1.0031 1.0014
dispcorr: -0.028735023 hartree
energy: -912.332139365093
dipole: 3.81105 -4.17934 -0.36829 -7.29347 7.08572 -0.20775 -1.14016 0.94654 -0.19362
magnitude: 0.46507 au
magnitude: 1.18210 debye
